has Book
comment: Relazione tra Trade Union e Book @it
domain: trade union
type: ObjectProperty
comment: Relation between Trade Union and Book
range: book

television show
type: Class
label: émission de télévision @fr

Ontology
extracted from: dbpedia.org
imports: cpannotationschema.owl
comment: TradeUnion Encyclopedic Knowledge Pattern
has author: Valentina Presutti
has author: Andrea Giovanni Nuzzolese
extracted from: en.wikipedia.org
has author: Aldo Gangemi
has intent: To represent the encyclopedic knowledge expressed by an object typed as TradeUnion

has Airline
comment: Relation between Trade Union and Airline
comment: Relazione tra Trade Union e Airline @it
range: airline
type: ObjectProperty
domain: trade union

disease
type: Class
label: maladie @fr

has Magazine
type: ObjectProperty
range: magazine
comment: Relation between Trade Union and Magazine
comment: Relazione tra Trade Union e Magazine @it
domain: trade union

automobile
type: Class

colour
type: Class
label: couleur @fr
label: χρώμα @el

Election
type: Class
label: élection @fr

american football player
label: joueur de football américain @fr
type: Class

has Park
comment: Relation between Trade Union and Park
range: park
type: ObjectProperty
domain: trade union
comment: Relazione tra Trade Union e Park @it

stadium
label: stade @fr
type: Class

soccer league
type: Class
label: ligue de football @fr

has Ship
range: ship
domain: trade union
comment: Relazione tra Trade Union e Ship @it
type: ObjectProperty
comment: Relation between Trade Union and Ship

mayor
label: maire @fr
type: Class

has Mountain
range: mountain
domain: trade union
comment: Relation between Trade Union and Mountain
comment: Relazione tra Trade Union e Mountain @it
type: ObjectProperty

pope
label: pape @fr
type: Class

newspaper
type: Class
label: journal @fr

protected area
label: aire protégée @fr
label: προστατευμένη περιοχή @el
type: Class

road
type: Class
label: route @fr

boxer
type: Class
label: boxeur @fr

has Musical Artist
comment: Relation between Trade Union and Musical Artist
comment: Relazione tra Trade Union e Musical Artist @it
range: musical artist
type: ObjectProperty
domain: trade union

judge
type: Class
label: juge @fr

has Mayor
domain: trade union
comment: Relation between Trade Union and Mayor
comment: Relazione tra Trade Union e Mayor @it
range: mayor
type: ObjectProperty

language
type: Class
label: langage @fr

station
type: Class

has Senator
comment: Relation between Trade Union and Senator
comment: Relazione tra Trade Union e Senator @it
type: ObjectProperty
domain: trade union
range: senator

has Writer
comment: Relation between Trade Union and Writer
type: ObjectProperty
range: writer
comment: Relazione tra Trade Union e Writer @it
domain: trade union

has Rugby Player
comment: Relazione tra Trade Union e Rugby Player @it
type: ObjectProperty
range: rugby player
domain: trade union
comment: Relation between Trade Union and Rugby Player

lake
type: Class
label: lac @fr

has Governor
domain: trade union
comment: Relation between Trade Union and Governor
range: governor
type: ObjectProperty
comment: Relazione tra Trade Union e Governor @it

has Island
range: island
comment: Relation between Trade Union and Island
domain: trade union
comment: Relazione tra Trade Union e Island @it
type: ObjectProperty

governor
label: gouverneur @fr
type: Class

has Stadium
type: ObjectProperty
comment: Relation between Trade Union and Stadium
comment: Relazione tra Trade Union e Stadium @it
domain: trade union
range: stadium

has Album
comment: Relation between Trade Union and Album
type: ObjectProperty
domain: trade union
comment: Relazione tra Trade Union e Album @it
range: album

has Village
type: ObjectProperty
domain: trade union
comment: Relation between Trade Union and Village
comment: Relazione tra Trade Union e Village @it
range: village

river
label: rivière @fr
type: Class

lacrosse league
label: ligue de crosse @fr
type: Class

school
label: école @fr
type: Class

museum
label: musée @fr
type: Class

ship
label: navire @fr
type: Class

has Broadcast
type: ObjectProperty
domain: trade union
comment: Relation between Trade Union and Broadcast
range: broadcast
comment: Relazione tra Trade Union e Broadcast @it

video game
type: Class
label: jeux vidéo @fr

trade union
label: syndicat professionnel @fr
type: Class

currency
label: devise @fr
type: Class

British royalty
label: royauté Britannique @fr
type: Class

prime minister
type: Class
label: premier ministre @fr

has Automobile
range: automobile
comment: Relazione tra Trade Union e Automobile @it
comment: Relation between Trade Union and Automobile
domain: trade union
type: ObjectProperty

has Museum
comment: Relation between Trade Union and Museum
domain: trade union
type: ObjectProperty
comment: Relazione tra Trade Union e Museum @it
range: museum

historic place
label: site historique @fr
type: Class

has Soccer League
domain: trade union
comment: Relazione tra Trade Union e Soccer League @it
comment: Relation between Trade Union and Soccer League
type: ObjectProperty
range: soccer league

hospital
label: hôpital @fr
type: Class

has Film
comment: Relation between Trade Union and Film
comment: Relazione tra Trade Union e Film @it
domain: trade union
range: film
type: ObjectProperty

has Judge
range: judge
type: ObjectProperty
domain: trade union
comment: Relation between Trade Union and Judge
comment: Relazione tra Trade Union e Judge @it

has Television Show
range: television show
domain: trade union
comment: Relazione tra Trade Union e Television Show @it
comment: Relation between Trade Union and Television Show
type: ObjectProperty

has Flowering Plant
comment: Relation between Trade Union and Flowering Plant
domain: trade union
comment: Relazione tra Trade Union e Flowering Plant @it
type: ObjectProperty
range: flowering plant

has Award
domain: trade union
comment: Relation between Trade Union and Award
range: award
type: ObjectProperty
comment: Relazione tra Trade Union e Award @it

continent
type: Class
label: ήπειρος @el

album
label: Album @de
type: Class

president
type: Class
label: président @fr

has Station
domain: trade union
comment: Relation between Trade Union and Station
type: ObjectProperty
comment: Relazione tra Trade Union e Station @it
range: station

has Newspaper
type: ObjectProperty
comment: Relation between Trade Union and Newspaper
domain: trade union
range: newspaper
comment: Relazione tra Trade Union e Newspaper @it

military unit
label: unité militaire @fr
type: Class

has Ice Hockey League
range: ice hockey league
comment: Relazione tra Trade Union e Ice Hockey League @it
domain: trade union
type: ObjectProperty
comment: Relation between Trade Union and Ice Hockey League

soccer manager
type: Class
label: entraîneur de football @fr

has Member Of Parliament
comment: Relation between Trade Union and Member Of Parliament
range: member of parliament
domain: trade union
comment: Relazione tra Trade Union e Member Of Parliament @it
type: ObjectProperty

has Website
domain: trade union
range: website
comment: Relation between Trade Union and Website
type: ObjectProperty
comment: Relazione tra Trade Union e Website @it

has American Football Team
range: american football team
comment: Relation between Trade Union and American Football Team
domain: trade union
type: ObjectProperty
comment: Relazione tra Trade Union e American Football Team @it

canadian football team
type: Class
label: équipe canadienne de football américain @fr

has Continent
comment: Relazione tra Trade Union e Continent @it
domain: trade union
comment: Relation between Trade Union and Continent
type: ObjectProperty
range: continent

writer
type: Class
label: écrivain @fr

has Musical
type: ObjectProperty
comment: Relazione tra Trade Union e Musical @it
range: musical
domain: trade union
comment: Relation between Trade Union and Musical

has Military Person
comment: Relazione tra Trade Union e Military Person @it
domain: trade union
range: military person
comment: Relation between Trade Union and Military Person
type: ObjectProperty

architect
type: Class
label: architecte @fr

has Supreme Court Of The United States Case
type: ObjectProperty
comment: Relazione tra Trade Union e Supreme Court Of The United States Case @it
comment: Relation between Trade Union and Supreme Court Of The United States Case
range: Supreme Court of the United States case
domain: trade union

has Currency
domain: trade union
range: currency
comment: Relation between Trade Union and Currency
type: ObjectProperty
comment: Relazione tra Trade Union e Currency @it

film festival
type: Class
label: festival du film @fr

has Lacrosse League
range: lacrosse league
comment: Relazione tra Trade Union e Lacrosse League @it
type: ObjectProperty
comment: Relation between Trade Union and Lacrosse League
domain: trade union

has Soccer Player
range: soccer player
comment: Relation between Trade Union and Soccer Player
comment: Relazione tra Trade Union e Soccer Player @it
type: ObjectProperty
domain: trade union

has Military Unit
range: military unit
domain: trade union
comment: Relation between Trade Union and Military Unit
comment: Relazione tra Trade Union e Military Unit @it
type: ObjectProperty

has Film Festival
range: film festival
type: ObjectProperty
comment: Relazione tra Trade Union e Film Festival @it
domain: trade union
comment: Relation between Trade Union and Film Festival

comics creator
type: Class
label: créateur de bandes dessinées @fr

aircraft
label: avion @fr
type: Class
label: αεροσκάφος @el

hockey team
label: équipe de hockey @fr
type: Class

has Television Episode
domain: trade union
type: ObjectProperty
range: television episode
comment: Relation between Trade Union and Television Episode
comment: Relazione tra Trade Union e Television Episode @it

has Military Conflict
comment: Relation between Trade Union and Military Conflict
domain: trade union
comment: Relazione tra Trade Union e Military Conflict @it
range: military conflict
type: ObjectProperty

soccer player
label: joueur de football @fr
type: Class

has Saint
domain: trade union
range: saint
type: ObjectProperty
comment: Relazione tra Trade Union e Saint @it
comment: Relation between Trade Union and Saint

legislature
type: Class
label: pouvoir législatif @fr

has Scientist
domain: trade union
comment: Relation between Trade Union and Scientist
range: scientist
type: ObjectProperty
comment: Relazione tra Trade Union e Scientist @it

has Prime Minister
type: ObjectProperty
comment: Relation between Trade Union and Prime Minister
comment: Relazione tra Trade Union e Prime Minister @it
range: prime minister
domain: trade union

airline
type: Class
label: compagnie aérienne @fr

has Congressman
comment: Relation between Trade Union and Congressman
range: congressman
domain: trade union
comment: Relazione tra Trade Union e Congressman @it
type: ObjectProperty

congressman
label: membre du Congrès @fr
type: Class

has Baseball League
domain: trade union
type: ObjectProperty
comment: Relazione tra Trade Union e Baseball League @it
comment: Relation between Trade Union and Baseball League
range: baseball league

golf player
label: golfeur @fr
type: Class

journalist
label: journaliste @fr
type: Class

has Legislature
comment: Relazione tra Trade Union e Legislature @it
comment: Relation between Trade Union and Legislature
range: legislature
type: ObjectProperty
domain: trade union

film
label: ταινία @el
type: Class

has Hockey Team
comment: Relazione tra Trade Union e Hockey Team @it
range: hockey team
type: ObjectProperty
domain: trade union
comment: Relation between Trade Union and Hockey Team

has Golf Player
domain: trade union
comment: Relazione tra Trade Union e Golf Player @it
range: golf player
type: ObjectProperty
comment: Relation between Trade Union and Golf Player

american football team
type: Class
label: équipe américaine de football américain @fr

Supreme Court of the United States case
type: Class
label: cas juridique de la Cour suprême des États-Unis @fr

has Ethnic Group
comment: Relation between Trade Union and Ethnic Group
comment: Relazione tra Trade Union e Ethnic Group @it
domain: trade union
range: ethnic group
type: ObjectProperty

has Language
comment: Relation between Trade Union and Language
domain: trade union
range: language
comment: Relazione tra Trade Union e Language @it
type: ObjectProperty

has Basketball League
comment: Relazione tra Trade Union e Basketball League @it
comment: Relation between Trade Union and Basketball League
type: ObjectProperty
range: basketball league
domain: trade union

has British Royalty
range: British royalty
comment: Relation between Trade Union and British Royalty
type: ObjectProperty
domain: trade union
comment: Relazione tra Trade Union e British Royalty @it

musical artist
label: artista musical @pt
type: Class
label: musicien @fr

has School
comment: Relation between Trade Union and School
domain: trade union
range: school
comment: Relazione tra Trade Union e School @it
type: ObjectProperty

has Non- Profit Organisation
comment: Relazione tra Trade Union e Non- Profit Organisation @it
comment: Relation between Trade Union and Non- Profit Organisation
domain: trade union
range: non-profit organisation
type: ObjectProperty

has Election
type: ObjectProperty
comment: Relation between Trade Union and Election
range: Election
domain: trade union
comment: Relazione tra Trade Union e Election @it

has Ice Hockey Player
range: ice hockey player
comment: Relation between Trade Union and Ice Hockey Player
domain: trade union
type: ObjectProperty
comment: Relazione tra Trade Union e Ice Hockey Player @it

park
label: parc @fr
type: Class

rugby player
type: Class
label: joueur de rugby @fr

american football league
type: Class

musical
label: musique @fr
type: Class

has Soccer Manager
range: soccer manager
type: ObjectProperty
domain: trade union
comment: Relation between Trade Union and Soccer Manager
comment: Relazione tra Trade Union e Soccer Manager @it

has President
domain: trade union
type: ObjectProperty
comment: Relation between Trade Union and President
range: president
comment: Relazione tra Trade Union e President @it

has Historic Place
comment: Relazione tra Trade Union e Historic Place @it
range: historic place
type: ObjectProperty
domain: trade union
comment: Relation between Trade Union and Historic Place

has Town
comment: Relation between Trade Union and Town
type: ObjectProperty
range: town
comment: Relazione tra Trade Union e Town @it
domain: trade union

basketball league
type: Class
label: ligue de basketball @fr

mountain
type: Class
label: montagne @fr
label: Βουνό @el

has Colour
domain: trade union
comment: Relazione tra Trade Union e Colour @it
range: colour
type: ObjectProperty
comment: Relation between Trade Union and Colour

criminal
label: criminel @fr
type: Class

flowering plant
type: Class
label: angiospermes @fr

has Adult Actor
comment: Relation between Trade Union and Adult Actor
range: adult actor
type: ObjectProperty
domain: trade union
comment: Relazione tra Trade Union e Adult Actor @it

saint
type: Class

senator
label: sénateur @fr
type: Class

comedian
type: Class
label: comédien @fr

has Baseball Player
range: baseball player
comment: Relation between Trade Union and Baseball Player
type: ObjectProperty
domain: trade union
comment: Relazione tra Trade Union e Baseball Player @it

has Comics Creator
type: ObjectProperty
domain: trade union
range: comics creator
comment: Relazione tra Trade Union e Comics Creator @it
comment: Relation between Trade Union and Comics Creator

has Beverage
comment: Relazione tra Trade Union e Beverage @it
domain: trade union
range: beverage
comment: Relation between Trade Union and Beverage
type: ObjectProperty

book
label: książka @pl
label: llibre @ca
label: βιβλίο @el
label: livre @fr
type: Class

has Airport
domain: trade union
range: airport
comment: Relation between Trade Union and Airport
comment: Relazione tra Trade Union e Airport @it
type: ObjectProperty

has River
comment: Relazione tra Trade Union e River @it
type: ObjectProperty
comment: Relation between Trade Union and River
domain: trade union
range: river

shopping mall
label: centre commercial @fr
type: Class

has Band
comment: Relation between Trade Union and Band
range: Band
comment: Relazione tra Trade Union e Band @it
domain: trade union
type: ObjectProperty

has Lake
comment: Relation between Trade Union and Lake
comment: Relazione tra Trade Union e Lake @it
range: lake
type: ObjectProperty
domain: trade union

non-profit organisation
label: organisation à but non lucratif @fr
type: Class

has American Football Player
comment: Relazione tra Trade Union e American Football Player @it
domain: trade union
comment: Relation between Trade Union and American Football Player
type: ObjectProperty
range: american football player

has College Coach
type: ObjectProperty
domain: trade union
comment: Relation between Trade Union and College Coach
comment: Relazione tra Trade Union e College Coach @it
range: college coach

has Cricketer
comment: Relazione tra Trade Union e Cricketer @it
domain: trade union
range: cricketer
comment: Relation between Trade Union and Cricketer
type: ObjectProperty

magazine
label: περιοδικό @el
type: Class

has Boxer
range: boxer
comment: Relazione tra Trade Union e Boxer @it
domain: trade union
type: ObjectProperty
comment: Relation between Trade Union and Boxer

has Philosopher
type: ObjectProperty
comment: Relation between Trade Union and Philosopher
range: philosopher
comment: Relazione tra Trade Union e Philosopher @it
domain: trade union

military person
type: Class
label: militaire @fr

has Aircraft
comment: Relazione tra Trade Union e Aircraft @it
type: ObjectProperty
domain: trade union
range: aircraft
comment: Relation between Trade Union and Aircraft

has Disease
comment: Relazione tra Trade Union e Disease @it
domain: trade union
comment: Relation between Trade Union and Disease
type: ObjectProperty
range: disease

has Shopping Mall
range: shopping mall
comment: Relazione tra Trade Union e Shopping Mall @it
comment: Relation between Trade Union and Shopping Mall
type: ObjectProperty
domain: trade union

philosopher
label: philosophe @fr
type: Class

award
type: Class
label: récompense @fr

sport
type: Class

cricketer
label: joueur de cricket @fr
type: Class

Band
label: groupe de musique @fr
type: Class
label: Musikgruppe @de
label: banda @pt

town
type: Class
label: ville @fr

has Pope
comment: Relation between Trade Union and Pope
comment: Relazione tra Trade Union e Pope @it
range: pope
type: ObjectProperty
domain: trade union

university
type: Class
label: université @fr
label: πανεπιστήμιο @el

ethnic group
type: Class
label: groupe ethnique @fr

has Canadian Football Team
comment: Relation between Trade Union and Canadian Football Team
comment: Relazione tra Trade Union e Canadian Football Team @it
domain: trade union
range: canadian football team
type: ObjectProperty

has Road
range: road
comment: Relation between Trade Union and Road
comment: Relazione tra Trade Union e Road @it
domain: trade union
type: ObjectProperty

college coach
type: Class
label: entraîneur universitaire @fr

has Comedian
comment: Relazione tra Trade Union e Comedian @it
range: comedian
comment: Relation between Trade Union and Comedian
domain: trade union
type: ObjectProperty

television episode
type: Class
label: épisode télévisé @fr

has Sport
comment: Relazione tra Trade Union e Sport @it
domain: trade union
range: sport
comment: Relation between Trade Union and Sport
type: ObjectProperty

village
type: Class
label: χωριό @el

ice hockey league
type: Class
label: ligue d'hockey sur glace @fr

has Protected Area
type: ObjectProperty
domain: trade union
range: protected area
comment: Relation between Trade Union and Protected Area
comment: Relazione tra Trade Union e Protected Area @it

soccer club
type: Class
label: club de football @fr

has Hospital
type: ObjectProperty
comment: Relation between Trade Union and Hospital
comment: Relazione tra Trade Union e Hospital @it
domain: trade union
range: hospital

office holder
label: titulaire @fr
label: Amtsinhaber @de
type: Class

baseball player
label: joueur de baseball @fr
type: Class

has Journalist
range: journalist
comment: Relation between Trade Union and Journalist
comment: Relazione tra Trade Union e Journalist @it
domain: trade union
type: ObjectProperty

has Skyscraper
range: skyscraper
type: ObjectProperty
comment: Relation between Trade Union and Skyscraper
comment: Relazione tra Trade Union e Skyscraper @it
domain: trade union

military conflict
label: conflit militaire @fr
type: Class

website
type: Class
label: Ιστότοπος @el
label: site web @fr

has American Football League
comment: Relation between Trade Union and American Football League
domain: trade union
type: ObjectProperty
range: american football league
comment: Relazione tra Trade Union e American Football League @it

adult actor
label: erwachsener Schauspieler @de
type: Class
label: acteur adulte @fr

ice hockey player
label: joueur de hockey sur glace @fr
type: Class

has Video Game
domain: trade union
range: video game
comment: Relazione tra Trade Union e Video Game @it
comment: Relation between Trade Union and Video Game
type: ObjectProperty

beverage
label: boisson @fr
type: Class

has Radio Station
type: ObjectProperty
domain: trade union
range: radio station
comment: Relazione tra Trade Union e Radio Station @it
comment: Relation between Trade Union and Radio Station

scientist
label: scientifique @fr
label: Wissenschaftler @de
type: Class

has Criminal
type: ObjectProperty
range: criminal
comment: Relation between Trade Union and Criminal
comment: Relazione tra Trade Union e Criminal @it
domain: trade union

baseball league
label: ligue de baseball @fr
type: Class

has Architect
comment: Relazione tra Trade Union e Architect @it
range: architect
type: ObjectProperty
domain: trade union
comment: Relation between Trade Union and Architect

has Office Holder
range: office holder
domain: trade union
comment: Relation between Trade Union and Office Holder
comment: Relazione tra Trade Union e Office Holder @it
type: ObjectProperty

broadcast
label: Émission de télévision @fr
type: Class

has University
range: university
comment: Relazione tra Trade Union e University @it
domain: trade union
type: ObjectProperty
comment: Relation between Trade Union and University

island
type: Class
label: νησί @el
label: île @fr

skyscraper
label: gratte-ciel @fr
type: Class

has Soccer Club
type: ObjectProperty
range: soccer club
domain: trade union
comment: Relazione tra Trade Union e Soccer Club @it
comment: Relation between Trade Union and Soccer Club

radio station
label: station de radio @fr
type: Class

member of parliament
type: Class
label: membre du Parlement @fr

airport
type: Class
label: Flughafen @de
label: aéroport @fr