Ontology
comment: This ontology contains the alignment between species data and gear data, through the property: caughtBy, defined here. The alignment has been made with linguistic matching methods by Wim Peters (University of Sheffield). The RDF OWL reengineering has been made by Aldo Gangemi (ISTC-CNR Rome).

caughtBy
type: ObjectProperty
range: GearType
domain: Species