Ontology
comment: This ontology contains the alignment between species data and commodities, through the property: usedFor, defined here. The alignment has been made with linguistic matching methods by Wim Peters (University of Sheffield). The RDF OWL reengineering has been made by Aldo Gangemi (ISTC-CNR Rome).

caughtBy
type: ObjectProperty
domain: Species
range: Fisheries commodity