valuemerge.owl
type: Ontology
comment: A quick and dirty collection of values, with their provenance and some of their expressed relations, from the Web. Relations include negative oppositions from Haidt (e.g. from Haidt J. and Graham J. When Morality Opposes Justice: Conservatives Have Moral Intuitions that Liberals may not Recognize. Social Justice Research, Vol. 20, No. 1, March 2007, 10.1007/s11211-007-0034-z), subsumptions from Schwartz' circumplex model (e.g. from Schwartz, S. H. (1992). Universals in the content and structure of values: theoretical advances and empirical tests in 20 countries. Adv. Exp. Soc. Psychol. 25, 1–65. doi: 10.1016/S0065-2601(08)60281-6; Schwartz, S. H. (2012). An Overview of the Schwartz Theory of Basic Values. Online Readings in Psychology and Culture, 2, 1, 10.9707/2307-0919.1116; Schwartz, S. H. (2014). Rethinking the concept and measurement of societal culture in light of empirical findings. J. Cross. Cult. Psychol. 45, 5–13, 10.1177/ 0022022113490830; Schwartz, S. H. A. (2006). theory of cultural value orientations: Explication and applications. Comp. Soc. 5, 137–182. doi: 10.1163/1569133067786 67357), and some clearly contrastive oppositions, also from Schwartz'. Subsumptions pair subclass taxonomies (following the D&S super-duper punning). Relations allow to infer a quite complex taxonomy, deserving investigation. Apparently, the circumplex model and related glosses hint at a more complex model of values (involving e.g. norms, goals, equilibria, causality, etc.), which needs to be designed, and used to refactor this collection with analytic axioms. For example, Self-protection values should include roles played by Self and Others, action or event types that may prize or harm the Self, parameters establishing the protection dimensions, related social and legal norms aimed at (or limiting) Self-protection, etc. Most values collected on the Web seem to reuse academic studies such as Schwartz, Haidt, etc., but it is interesting to spot the convergence among psychologic…
version info: 0.1, 04-03-2021, by Aldo Gangemi

contrasts
type: ObjectProperty
type: SymmetricProperty
domain: IndividualValue
range: IndividualValue
comment: Schwartz' contrastive opposition relation, designed as a symmetric property. In Schwartz' theory, such contrast entails conflict, and should lead to a disjointness relation between the situation classes satisfying the contrasted values. However, the conflict assumption is heavily debated in literature.

hasNegative
type: ObjectProperty
inverse of: hasPositive
domain: IndividualValue
range: NegativeValue
comment: A (judgmentally, culturally dependent) opposition between a (positive) value, and a negative one. Cf. Haidt and Graham 2007, who however claim the universality of the polarity. Due to the asymmetry in the notion, the relation is not symmetric.

acceptance
type: Class
subclass of: feelings
subclass of: Restriction
  on property: DUL.owlsatisfies
  some values from: Class
    one of: acceptance
type: NamedIndividual
type: IndividualValue
subsumed under: feelings
was attributed to: https://georgetownpsychology.com/inner-values/
comment: Our world has billions of people in it–all of whom are somehow unique. Being able to accept people who are completely different from you can help increase the pleasure and enlightenment in your life.

accomplishment
type: Class
subclass of: achievement
subclass of: Restriction
  on property: DUL.owlsatisfies
  some values from: Class
    one of: accomplishment
type: NamedIndividual
type: IndividualValue
subsumed under: achievement
was attributed to: https://scottjeffrey.com/core-values-list/

accountability
type: Class
subclass of: integrity
subclass of: Restriction
  on property: DUL.owlsatisfies
  some values from: Class
    one of: accountability
type: NamedIndividual
type: IndividualValue
subsumed under: integrity
was attributed to: https://georgetownpsychology.com/inner-values/

accuracy
type: Class
subclass of: order , orderliness
subclass of: Restriction
  on property: DUL.owlsatisfies
  some values from: Class
    one of: accuracy
type: NamedIndividual
type: IndividualValue
subsumed under: order , orderliness
was attributed to: https://www.developgoodhabits.com/core-values/ , https://scottjeffrey.com/core-values-list/
comment: Whether you’re working with data at work or in your personal life, valuing accuracy allows you to gain the necessary insight to make the best decisions. While some people and companies focus a great deal of attention on getting as much information as possible, the information gathered is not always correct, and often people gain knowledge that they don’t even know what to do with. But if you value accuracy, you will be less likely to make errors or waste time with useless information.

achievement
type: Class
subclass of: self-enhancement
subclass of: Restriction
  on property: DUL.owlsatisfies
  some values from: Class
    one of: achievement
type: NamedIndividual
type: IndividualValue
subsumed under: self-enhancement
comment: Accomplishing something in your life or work that is noteworthy could be something that adds a unique sense of value to your life. Your achievement values impact your motivation because your incentive to work outweighs the cost of doing so.
was attributed to: Schwartz92
comment: Defining goal: personal success through demonstrating competence according to social standards.

action
type: Class
subclass of: self-direction
subclass of: Restriction
  on property: DUL.owlsatisfies
  some values from: Class
    one of: action
type: NamedIndividual
subsumed under: self-direction
was attributed to: Schwartz92

adaptability
type: Class
subclass of: spirituality
subclass of: Restriction
  on property: DUL.owlsatisfies
  some values from: Class
    one of: adaptability
type: NamedIndividual
type: IndividualValue
subsumed under: spirituality
was attributed to: https://georgetownpsychology.com/inner-values/

adventure
type: Class
subclass of: openness to change
subclass of: self-enhancement
subclass of: Restriction
  on property: DUL.owlsatisfies
  some values from: Class
    one of: adventure
type: NamedIndividual
type: IndividualValue
subsumed under: openness to change
comment: Those who value adventure lead rich and exciting lives by seeking out new experiences to expand their skills and existence.
was attributed to: https://www.developgoodhabits.com/core-values/ , https://themindfool.com/list-of-core-values-for-a-balanced-life/
label: adventure , adventurous

affective autonomy
type: Class
subclass of: ValueSituation
subclass of: Restriction
  on property: DUL.owlsatisfies
  some values from: Class
    one of: affective autonomy
type: NamedIndividual
type: CulturalValue
contrasts: embeddedness
was attributed to: Schwartz2006

alertness
type: Class
subclass of: presence , present
subclass of: Restriction
  on property: DUL.owlsatisfies
  some values from: Class
    one of: alertness
type: NamedIndividual
type: IndividualValue
subsumed under: presence , present
was attributed to: https://scottjeffrey.com/core-values-list/

altruism
type: Class
subclass of: spirituality
subclass of: Restriction
  on property: DUL.owlsatisfies
  some values from: Class
    one of: altruism
type: NamedIndividual
type: IndividualValue
subsumed under: spirituality
was attributed to: https://georgetownpsychology.com/inner-values/
comment: Those who value altruism have an unselfish concern for other people. They perform random acts of kindness on a regular basis and do things to help others for the sole reason of benefitting someone else in some way. Valuing altruism means you don’t feel obligated to do anything for others due to having a sense of loyalty or even for religious reasons. If you make it a priority to do selfless acts, you value altruism.

ambition
type: Class
subclass of: achievement
subclass of: strength
subclass of: Restriction
  on property: DUL.owlsatisfies
  some values from: Class
    one of: ambition
type: NamedIndividual
type: IndividualValue
subsumed under: achievement
was attributed to: Schwartz92
label: ambition , ambitious

amusement
type: Class
subclass of: enjoyment
subclass of: Restriction
  on property: DUL.owlsatisfies
  some values from: Class
    one of: amusement
type: NamedIndividual
type: IndividualValue
subsumed under: enjoyment
was attributed to: https://scottjeffrey.com/core-values-list/

analysis
type: Class
subclass of: ValueSituation
subclass of: Restriction
  on property: DUL.owlsatisfies
  some values from: Class
    one of: analysis
type: NamedIndividual
type: IndividualValue
was attributed to: https://themindfool.com/list-of-core-values-for-a-balanced-life/

anticipation
type: Class
subclass of: ValueSituation
subclass of: Restriction
  on property: DUL.owlsatisfies
  some values from: Class
    one of: anticipation
type: NamedIndividual
type: IndividualValue
was attributed to: https://themindfool.com/list-of-core-values-for-a-balanced-life/

anxiety avoidance
type: Class
subclass of: ValueSituation
subclass of: Restriction
  on property: DUL.owlsatisfies
  some values from: Class
    one of: anxiety avoidance
type: NamedIndividual
type: IndividualValue
was attributed to: Schwartz92

anxiety-free
type: Class
subclass of: ValueSituation
subclass of: Restriction
  on property: DUL.owlsatisfies
  some values from: Class
    one of: anxiety-free
type: NamedIndividual
type: IndividualValue
was attributed to: Schwartz92

approachability
type: Class
subclass of: self-transcendence
subclass of: Restriction
  on property: DUL.owlsatisfies
  some values from: Class
    one of: approachability
type: NamedIndividual
type: IndividualValue
subsumed under: self-transcendence
was attributed to: https://www.developgoodhabits.com/core-values/ , https://themindfool.com/list-of-core-values-for-a-balanced-life/
label: approachability , attainability , attainable
comment: People who hold a personal core value of being approachable want others to feel free to come to them with problems. People who want to be approachable often easily gain the trust of other people.

assertion
type: Class
subclass of: strength
subclass of: Restriction
  on property: DUL.owlsatisfies
  some values from: Class
    one of: assertion
type: NamedIndividual
type: IndividualValue
subsumed under: strength
was attributed to: https://www.developgoodhabits.com/core-values/ , https://scottjeffrey.com/core-values-list/
comment: Those who value being assertive know what they want, act quickly to obtain it, and do what they have to do to be successful.
label: assertion , assertiveness

association
type: Class
subclass of: community
subclass of: Restriction
  on property: DUL.owlsatisfies
  some values from: Class
    one of: association
type: NamedIndividual
type: IndividualValue
subsumed under: community
was attributed to: https://themindfool.com/list-of-core-values-for-a-balanced-life/

attentiveness
type: Class
subclass of: presence , present
subclass of: Restriction
  on property: DUL.owlsatisfies
  some values from: Class
    one of: attentiveness
type: NamedIndividual
type: IndividualValue
subsumed under: presence , present
label: attentiveness , attentive
was attributed to: https://georgetownpsychology.com/inner-values/

authenticity
type: Class
subclass of: ValueSituation
subclass of: Restriction
  on property: DUL.owlsatisfies
  some values from: Class
    one of: authenticity
type: NamedIndividual
type: IndividualValue
was attributed to: https://www.developgoodhabits.com/core-values/ , https://themindfool.com/list-of-core-values-for-a-balanced-life/ , https://benjaminspall.com/core-values/
comment: Not valuing authenticity, especially when it comes to your own actions, can result in anxiety, frustration, depression, and a loss of meaning in your life. Many people present themselves in a way they believe is the most socially acceptable or in a way that they think other people want them to present themselves.

authority
type: Class
subclass of: power
subclass of: Restriction
  on property: DUL.owlsatisfies
  some values from: Class
    one of: authority
type: NamedIndividual
type: IndividualValue
has negative: subversion
subsumed under: power
was attributed to: Haidt, Schwartz92

awareness
type: Class
subclass of: presence , present
subclass of: Restriction
  on property: DUL.owlsatisfies
  some values from: Class
    one of: awareness
type: NamedIndividual
type: IndividualValue
subsumed under: presence , present
was attributed to: https://georgetownpsychology.com/inner-values/

balance
type: Class
subclass of: spirituality
subclass of: Restriction
  on property: DUL.owlsatisfies
  some values from: Class
    one of: balance
type: NamedIndividual
type: IndividualValue
subsumed under: spirituality
was attributed to: https://georgetownpsychology.com/inner-values/
comment: If one of your personal core values is balance, you prevent any one thing from taking over your life. Between your career, family, friends, and hobbies, you make sure to keep your own personal enjoyment in mind and you level out your stress with relaxation.

beauty
type: Class
subclass of: presence , present
subclass of: Restriction
  on property: DUL.owlsatisfies
  some values from: Class
    one of: beauty
type: NamedIndividual
type: IndividualValue
subsumed under: presence , present
was attributed to: https://scottjeffrey.com/core-values-list/

belief in God
type: Class
subclass of: beliefs
subclass of: Restriction
  on property: DUL.owlsatisfies
  some values from: Class
    one of: belief in God
type: NamedIndividual
type: IndividualValue
subsumed under: beliefs
was attributed to: https://examples.yourdictionary.com/examples-of-core-values.html

beliefs
type: Class
subclass of: ValueSituation
subclass of: Restriction
  on property: DUL.owlsatisfies
  some values from: Class
    one of: beliefs
type: NamedIndividual
type: IndividualValue
was attributed to: https://themindfool.com/list-of-core-values-for-a-balanced-life/

benevolence
type: Class
subclass of: self-transcendence
subclass of: Restriction
  on property: DUL.owlsatisfies
  some values from: Class
    one of: benevolence
type: NamedIndividual
type: IndividualValue
subsumed under: self-transcendence
was attributed to: Schwartz92
comment: Defining goal: preserving and enhancing the welfare of those with whom one is in frequent personal contact (the ‘in-group’).

boldness , bold
type: Class
subclass of: strength
subclass of: Restriction
  on property: DUL.owlsatisfies
  some values from: Class
    one of: boldness , bold
type: NamedIndividual
type: IndividualValue
subsumed under: strength
label: boldness
was attributed to: https://georgetownpsychology.com/inner-values/

bravery
type: Class
subclass of: courage
subclass of: Restriction
  on property: DUL.owlsatisfies
  some values from: Class
    one of: bravery
type: NamedIndividual
type: IndividualValue
subsumed under: courage
was attributed to: https://georgetownpsychology.com/inner-values/
comment: When one of your personal core values is bravery, it means that you always do the right thing, even if you’re the only person making the tough decision.

brilliance
type: Class
subclass of: intelligence
subclass of: Restriction
  on property: DUL.owlsatisfies
  some values from: Class
    one of: brilliance
type: NamedIndividual
type: IndividualValue
subsumed under: intelligence
was attributed to: https://scottjeffrey.com/core-values-list/

building communities
type: Class
subclass of: community
subclass of: Restriction
  on property: DUL.owlsatisfies
  some values from: Class
    one of: building communities
type: NamedIndividual
type: IndividualValue
subsumed under: community

calmness
type: Class
subclass of: presence , present
subclass of: Restriction
  on property: DUL.owlsatisfies
  some values from: Class
    one of: calmness
type: NamedIndividual
type: IndividualValue
subsumed under: presence , present
label: calmness , calm
comment: Valuing calmness helps you stay relatively relaxed and think logically during high-pressure situations. This is an important value to hold if you often face adversity, because with a calm mind, you can have mental clarity and find solutions to problems you’re facing by making reasonable decisions or compromises with other people rather than fighting. This article offers some tips to help you calm your mind if you feel like it’s constantly racing.
was attributed to: https://georgetownpsychology.com/inner-values/

candor
type: Class
subclass of: integrity
subclass of: Restriction
  on property: DUL.owlsatisfies
  some values from: Class
    one of: candor
type: NamedIndividual
type: IndividualValue
subsumed under: integrity
comment: Being able to tell things like they are is a helpful core value because many people shy away from the truth in fear of hurting others or becoming chastised.
was attributed to: https://georgetownpsychology.com/inner-values/

capable
type: Class
subclass of: achievement
subclass of: Restriction
  on property: DUL.owlsatisfies
  some values from: Class
    one of: capable
type: NamedIndividual
type: IndividualValue
subsumed under: achievement
was attributed to: https://scottjeffrey.com/core-values-list/

carefulness
type: Class
subclass of: benevolence
subclass of: order , orderliness
subclass of: Restriction
  on property: DUL.owlsatisfies
  some values from: Class
    one of: carefulness
type: NamedIndividual
type: IndividualValue
has negative: harm
subsumed under: benevolence
label: carefulness , care , caring
was attributed to: Haidt, https://georgetownpsychology.com/inner-values/ , Schwartz92

certainty
type: Class
subclass of: order , orderliness
subclass of: Restriction
  on property: DUL.owlsatisfies
  some values from: Class
    one of: certainty
type: NamedIndividual
type: IndividualValue
subsumed under: order , orderliness
was attributed to: https://scottjeffrey.com/core-values-list/

challenge
type: Class
subclass of: achievement
subclass of: Restriction
  on property: DUL.owlsatisfies
  some values from: Class
    one of: challenge
type: NamedIndividual
type: IndividualValue
subsumed under: achievement
comment: Valuing challenge and continually finding different avenues to challenge yourself is one of the best ways to ensure consistent personal growth. Facing challenges allows you opportunities to thrive and push yourself beyond what you once believed to be your limits to accomplish things and make progress. The more willing you are to face challenges, the richer your life will be.
was attributed to: https://www.developgoodhabits.com/core-values/ , https://themindfool.com/list-of-core-values-for-a-balanced-life/ , https://scottjeffrey.com/core-values-list/

charity
type: Class
subclass of: spirituality
subclass of: Restriction
  on property: DUL.owlsatisfies
  some values from: Class
    one of: charity
type: NamedIndividual
type: IndividualValue
subsumed under: spirituality
was attributed to: https://georgetownpsychology.com/inner-values/

clarity
type: Class
subclass of: presence , present
subclass of: Restriction
  on property: DUL.owlsatisfies
  some values from: Class
    one of: clarity
type: NamedIndividual
type: IndividualValue
subsumed under: presence , present
was attributed to: https://themindfool.com/list-of-core-values-for-a-balanced-life/ , https://scottjeffrey.com/core-values-list/
label: clarity , clear

cleanliness
type: Class
subclass of: order , orderliness
subclass of: security
subclass of: Restriction
  on property: DUL.owlsatisfies
  some values from: Class
    one of: cleanliness
type: NamedIndividual
type: IndividualValue
subsumed under: order , orderliness
was attributed to: https://georgetownpsychology.com/inner-values/ , Schwartz92

cleverness
type: Class
subclass of: intelligence
subclass of: Restriction
  on property: DUL.owlsatisfies
  some values from: Class
    one of: cleverness
type: NamedIndividual
type: IndividualValue
subsumed under: intelligence
was attributed to: https://georgetownpsychology.com/inner-values/

collaboration
type: Class
subclass of: community
subclass of: Restriction
  on property: DUL.owlsatisfies
  some values from: Class
    one of: collaboration
type: NamedIndividual
type: IndividualValue
subsumed under: community
comment: Working together by sharing your ideas with others can result in accomplishing something great. Collaborating with others will often lead to something that is greater than the sum of its parts.
was attributed to: https://www.developgoodhabits.com/core-values/

comfort
type: Class
subclass of: feelings
subclass of: Restriction
  on property: DUL.owlsatisfies
  some values from: Class
    one of: comfort
type: NamedIndividual
type: IndividualValue
subsumed under: feelings
was attributed to: https://scottjeffrey.com/core-values-list/

commitment
type: Class
subclass of: integrity
subclass of: Restriction
  on property: DUL.owlsatisfies
  some values from: Class
    one of: commitment
type: NamedIndividual
type: IndividualValue
subsumed under: integrity
was attributed to: https://georgetownpsychology.com/inner-values/
comment: People commit to things that they believe in–whether that’s a relationship, a new opportunity, or anything else that seems truly promising. Those who value commitment are good at managing both personal and professional relationships, especially when it comes to handling conflicts, building a sense of trust, collaborating with others, and working well on a team. When commitment is on your list of values, you likely also have:A strong work ethic; Feelings of accountability; Passion; Discipline.

common sense
type: Class
subclass of: intelligence
subclass of: Restriction
  on property: DUL.owlsatisfies
  some values from: Class
    one of: common sense
type: NamedIndividual
type: IndividualValue
subsumed under: intelligence
was attributed to: https://georgetownpsychology.com/inner-values/

communication
type: Class
subclass of: spirituality
subclass of: Restriction
  on property: DUL.owlsatisfies
  some values from: Class
    one of: communication
type: NamedIndividual
type: IndividualValue
subsumed under: spirituality
comment: Valuing communication involves not only having information relayed properly to you, but also ensuring that your own thoughts are effectively heard by other people.
was attributed to: https://georgetownpsychology.com/inner-values/

community
type: Class
subclass of: spirituality
subclass of: Restriction
  on property: DUL.owlsatisfies
  some values from: Class
    one of: community
type: NamedIndividual
type: IndividualValue
subsumed under: spirituality
comment: Valuing community means striving to create a sense of belongingness in your surroundings and being willing to give back to places that have contributed to who you are today.
was attributed to: https://www.developgoodhabits.com/core-values/ , https://themindfool.com/list-of-core-values-for-a-balanced-life/ , https://scottjeffrey.com/core-values-list/

compassion
type: Class
subclass of: feelings
subclass of: Restriction
  on property: DUL.owlsatisfies
  some values from: Class
    one of: compassion
type: NamedIndividual
type: IndividualValue
subsumed under: feelings
was attributed to: https://georgetownpsychology.com/inner-values/

competence
type: Class
subclass of: achievement
subclass of: Restriction
  on property: DUL.owlsatisfies
  some values from: Class
    one of: competence
type: NamedIndividual
type: IndividualValue
subsumed under: achievement
was attributed to: https://georgetownpsychology.com/inner-values/

competition
type: Class
subclass of: ValueSituation
subclass of: Restriction
  on property: DUL.owlsatisfies
  some values from: Class
    one of: competition
type: NamedIndividual
type: IndividualValue
was attributed to: https://www.developgoodhabits.com/core-values/
comment: Holding a value of competition means that you are able to gain energy through a sense of rivalry to be the most respected in a domain. But it's important to learn the difference between healthy and unhealthy competition.

compliance
type: Class
subclass of: conservation
subclass of: order , orderliness
subclass of: Restriction
  on property: DUL.owlsatisfies
  some values from: Class
    one of: compliance
type: NamedIndividual
type: IndividualValue
subsumed under: conservation
was attributed to: https://www.developgoodhabits.com/core-values/
comment: Being compliant does not mean you’re weak. There is a lot of value in having the ability to follow directions or take the advice of a superior.

composure
type: Class
subclass of: self-control
subclass of: Restriction
  on property: DUL.owlsatisfies
  some values from: Class
    one of: composure
type: NamedIndividual
type: IndividualValue
subsumed under: self-control
was attributed to: https://www.developgoodhabits.com/core-values/
comment: The ability to remain calm in the face of adversity and control your emotions helps people trust you and feel like you’re a reliable and poised person.

concentration
type: Class
subclass of: presence , present
subclass of: Restriction
  on property: DUL.owlsatisfies
  some values from: Class
    one of: concentration
type: NamedIndividual
type: IndividualValue
subsumed under: presence , present
was attributed to: https://scottjeffrey.com/core-values-list/

concern for others
type: Class
subclass of: empathy
subclass of: universalism
subclass of: Restriction
  on property: DUL.owlsatisfies
  some values from: Class
    one of: concern for others
type: NamedIndividual
type: IndividualValue
subsumed under: empathy
was attributed to: Schwartz92

confidence
type: Class
subclass of: strength
subclass of: Restriction
  on property: DUL.owlsatisfies
  some values from: Class
    one of: confidence
type: NamedIndividual
type: IndividualValue
subsumed under: strength
comment: Being confident often helps people trust you and your decisions. When you value confidence, it suggests you also value competence. Your confidence is the sense of value that you place on yourself and the faith you have in your own capabilities. It gives you the strength to pursue what you want in life.
was attributed to: https://georgetownpsychology.com/inner-values/

conformity
type: Class
subclass of: conservation
subclass of: social focus
subclass of: Restriction
  on property: DUL.owlsatisfies
  some values from: Class
    one of: conformity
type: NamedIndividual
type: IndividualValue
subsumed under: conservation
subsumed under: social focus
comment: Defining goal: restraint of actions, inclinations, and impulses likely to upset or harm others and violate social expectations or norms.
was attributed to: Schwartz92

congruence
type: Class
subclass of: ValueSituation
subclass of: Restriction
  on property: DUL.owlsatisfies
  some values from: Class
    one of: congruence
type: NamedIndividual
type: IndividualValue
was attributed to: https://www.developgoodhabits.com/core-values/
comment: This involves being true to your authentic self and communicating to others externally in a way that matches your internal thoughts and feelings.

connection , connectedness
type: Class
subclass of: spirituality
subclass of: Restriction
  on property: DUL.owlsatisfies
  some values from: Class
    one of: connection , connectedness
type: NamedIndividual
type: IndividualValue
subsumed under: spirituality
was attributed to: https://georgetownpsychology.com/inner-values/
label: connection

consciousness
type: Class
subclass of: spirituality
subclass of: Restriction
  on property: DUL.owlsatisfies
  some values from: Class
    one of: consciousness
type: NamedIndividual
type: IndividualValue
subsumed under: spirituality
was attributed to: https://scottjeffrey.com/core-values-list/

consent
type: Class
subclass of: ValueSituation
subclass of: Restriction
  on property: DUL.owlsatisfies
  some values from: Class
    one of: consent
type: NamedIndividual
type: IndividualValue
was attributed to: https://themindfool.com/list-of-core-values-for-a-balanced-life/

conservation
type: Class
subclass of: anxiety avoidance
subclass of: self-protection
subclass of: Restriction
  on property: DUL.owlsatisfies
  some values from: Class
    one of: conservation
type: NamedIndividual
type: IndividualValue
subsumed under: anxiety avoidance
subsumed under: self-protection
comment: This dimension captures the conflict between values that emphasize independence of thought, action, and feelings and readiness for change (self-direction, stimulation) and values that emphasize order, self-restriction, preservation of the past, and resistance to change (security, conformity, tradition).”
comment: Wanting to conserve what you currently have and not constantly seeking more resources to consume is an important value to have. When you value conservation, there is a good chance that you are satisfied with the things you have and content in your life.
was attributed to: Schwartz92

consideration
type: Class
subclass of: community
subclass of: Restriction
  on property: DUL.owlsatisfies
  some values from: Class
    one of: consideration
type: NamedIndividual
type: IndividualValue
subsumed under: community
was attributed to: https://www.developgoodhabits.com/core-values/
comment: Being considerate of others, even if they aren’t around, is a strong value to have. This means leaving places better than you found them and keeping other people’s needs in mind.

consistency
type: Class
subclass of: order , orderliness
subclass of: Restriction
  on property: DUL.owlsatisfies
  some values from: Class
    one of: consistency
type: NamedIndividual
type: IndividualValue
subsumed under: order , orderliness
comment: Consistency often gives people reassurance in the decisions that they make because they can rely on a certain process that they’re used to.
was attributed to: https://georgetownpsychology.com/inner-values/

contentment
type: Class
subclass of: feelings
subclass of: Restriction
  on property: DUL.owlsatisfies
  some values from: Class
    one of: contentment
type: NamedIndividual
type: IndividualValue
subsumed under: feelings
was attributed to: https://georgetownpsychology.com/inner-values/

continuous learning
type: Class
subclass of: self-enhancement
subclass of: Restriction
  on property: DUL.owlsatisfies
  some values from: Class
    one of: continuous learning
type: NamedIndividual
type: IndividualValue
subsumed under: self-enhancement
comment: People who value continuous learning are the same people who value self-improvement and continued success. With access to information at our fingertips, those who value continuous learning are in luck, as the ability to teach oneself about any topic is simple.
was attributed to: https://www.developgoodhabits.com/core-values/

contribution
type: Class
subclass of: spirituality
subclass of: Restriction
  on property: DUL.owlsatisfies
  some values from: Class
    one of: contribution
type: NamedIndividual
type: IndividualValue
subsumed under: spirituality
was attributed to: https://georgetownpsychology.com/inner-values/

control
type: Class
subclass of: order , orderliness
subclass of: Restriction
  on property: DUL.owlsatisfies
  some values from: Class
    one of: control
type: NamedIndividual
type: IndividualValue
subsumed under: order , orderliness
was attributed to: https://scottjeffrey.com/core-values-list/

control over resources
type: Class
subclass of: power
subclass of: Restriction
  on property: DUL.owlsatisfies
  some values from: Class
    one of: control over resources
type: NamedIndividual
subsumed under: power
was attributed to: Schwartz92

conviction
type: Class
subclass of: courage
subclass of: Restriction
  on property: DUL.owlsatisfies
  some values from: Class
    one of: conviction
type: NamedIndividual
type: IndividualValue
subsumed under: courage
was attributed to: https://georgetownpsychology.com/inner-values/

cooperation
type: Class
subclass of: spirituality
subclass of: Restriction
  on property: DUL.owlsatisfies
  some values from: Class
    one of: cooperation
type: NamedIndividual
type: IndividualValue
subsumed under: spirituality
was attributed to: https://georgetownpsychology.com/inner-values/

courage
type: Class
subclass of: ValueSituation
subclass of: Restriction
  on property: DUL.owlsatisfies
  some values from: Class
    one of: courage
type: NamedIndividual
type: IndividualValue
was attributed to: https://georgetownpsychology.com/inner-values/
comment: As one of the principal characteristics of leadership, courage guarantees a lot of other great qualities in a leader. Courage demonstrates confidence and a willingness to use your voice to influence others. Courage is an important value to have because it defines your decision to act according to your values and work toward your goals instead of letting yourself be distracted or allured by irrelevant and potentially harmful temptations.

courtesy
type: Class
subclass of: spirituality
subclass of: Restriction
  on property: DUL.owlsatisfies
  some values from: Class
    one of: courtesy
type: NamedIndividual
type: IndividualValue
subsumed under: spirituality
was attributed to: https://georgetownpsychology.com/inner-values/

creativity
type: Class
subclass of: self-direction
subclass of: ValueSituation
subclass of: Restriction
  on property: DUL.owlsatisfies
  some values from: Class
    one of: creativity
type: NamedIndividual
type: IndividualValue
subsumed under: self-direction
label: creativity , creativeness , creation
was attributed to: https://georgetownpsychology.com/inner-values/ , Schwartz92
comment: If you value creativity, you enjoy using your imagination to solve problems or generate new ideas. Valuing creativity supports your ability to make a change in society that other people find significant.

credibility
type: Class
subclass of: achievement
subclass of: Restriction
  on property: DUL.owlsatisfies
  some values from: Class
    one of: credibility
type: NamedIndividual
type: IndividualValue
subsumed under: achievement
was attributed to: https://georgetownpsychology.com/inner-values/

CulturalValue
type: Class
subclass of: Value
comment: Cultural values represent ideals that shape the beliefs and actions of individuals and groups in the culture. They act as societal responses to three main challenges to a successful cohabitation: relations between individuals and groups (contrasting Intellectual/Affective Autonomy vs. Embeddedness); the way individuals act in a responsible manner toward preserving the well-being of their society (contrasting Egalitarianism vs. Hierarchy); individuals’ interests regarding the natural and social environment (contrasting Harmony vs. Mastery) (Schwartz2006). In contrast to individual values, which are observable constructs affecting individual behavior, cultural values are abstract constructs (Schwartz2014), which manifest in various forms ranging from written artifacts to knowledge that members of the culture communicate amongst each other. Methodological discussion in: Erich H. Witte, Adrian Stanciu and Klaus Boehnke. A New Empirical Approach to Intercultural Comparisons of Value Preferences Based on Schwartz’s Theory. Front. Psychol., 14 July 2020, 10.3389/fpsyg.2020.01723

curiosity
type: Class
subclass of: creativity
subclass of: Restriction
  on property: DUL.owlsatisfies
  some values from: Class
    one of: curiosity
type: NamedIndividual
type: IndividualValue
subsumed under: creativity
was attributed to: https://georgetownpsychology.com/inner-values/

daring
type: Class
subclass of: stimulation
subclass of: Restriction
  on property: DUL.owlsatisfies
  some values from: Class
    one of: daring
type: NamedIndividual
type: IndividualValue
subsumed under: stimulation
was attributed to: Schwartz92

decision_making
type: Class
subclass of: order , orderliness
subclass of: Restriction
  on property: DUL.owlsatisfies
  some values from: Class
    one of: decision_making
type: NamedIndividual
type: IndividualValue
subsumed under: order , orderliness
was attributed to: https://www.developgoodhabits.com/core-values/
label: decision-Making , decisive
comment: Taking personal responsibility for initiating a course of action may be of high value to you. This means that you find it fulfilling to act according to your own conscience without having to be prompted by an external force.

decisiveness
type: Class
subclass of: intelligence
subclass of: Restriction
  on property: DUL.owlsatisfies
  some values from: Class
    one of: decisiveness
type: NamedIndividual
type: IndividualValue
subsumed under: intelligence
was attributed to: https://georgetownpsychology.com/inner-values/

dedication
type: Class
subclass of: strength
subclass of: Restriction
  on property: DUL.owlsatisfies
  some values from: Class
    one of: dedication
type: NamedIndividual
type: IndividualValue
subsumed under: strength
was attributed to: https://georgetownpsychology.com/inner-values/

dependability
type: Class
subclass of: benevolence
subclass of: integrity
subclass of: Restriction
  on property: DUL.owlsatisfies
  some values from: Class
    one of: dependability
type: NamedIndividual
type: IndividualValue
subsumed under: benevolence
was attributed to: https://georgetownpsychology.com/inner-values/ , Schwartz92

determination
type: Class
subclass of: achievement
subclass of: Restriction
  on property: DUL.owlsatisfies
  some values from: Class
    one of: determination
type: NamedIndividual
type: IndividualValue
subsumed under: achievement
was attributed to: https://georgetownpsychology.com/inner-values/
comment: Refusing to give up when things get tough changes challenging situations into opportunities for triumph.

development
type: Class
subclass of: achievement
subclass of: Restriction
  on property: DUL.owlsatisfies
  some values from: Class
    one of: development
type: NamedIndividual
type: IndividualValue
subsumed under: achievement
was attributed to: https://scottjeffrey.com/core-values-list/

devotion , devout
type: Class
subclass of: spirituality
subclass of: tradition , traditional, eespect for tradition
subclass of: Restriction
  on property: DUL.owlsatisfies
  some values from: Class
    one of: devotion , devout
type: NamedIndividual
type: IndividualValue
subsumed under: spirituality
was attributed to: https://georgetownpsychology.com/inner-values/ , Schwartz92
label: devotion

dignity
type: Class
subclass of: integrity
subclass of: Restriction
  on property: DUL.owlsatisfies
  some values from: Class
    one of: dignity
type: NamedIndividual
type: IndividualValue
subsumed under: integrity
was attributed to: https://georgetownpsychology.com/inner-values/

discipline
type: Class
subclass of: strength
subclass of: Restriction
  on property: DUL.owlsatisfies
  some values from: Class
    one of: discipline
type: NamedIndividual
type: IndividualValue
subsumed under: strength
was attributed to: https://georgetownpsychology.com/inner-values/

discovery
type: Class
subclass of: creativity
subclass of: Restriction
  on property: DUL.owlsatisfies
  some values from: Class
    one of: discovery
type: NamedIndividual
type: IndividualValue
subsumed under: creativity
was attributed to: https://georgetownpsychology.com/inner-values/

distinctiveness
type: Class
subclass of: ValueSituation
subclass of: Restriction
  on property: DUL.owlsatisfies
  some values from: Class
    one of: distinctiveness
type: NamedIndividual
type: IndividualValue
was attributed to: https://themindfool.com/list-of-core-values-for-a-balanced-life/

diversity
type: Class
subclass of: ValueSituation
subclass of: Restriction
  on property: DUL.owlsatisfies
  some values from: Class
    one of: diversity
type: NamedIndividual
type: IndividualValue
comment: Diversity isn’t only about accepting people from different cultures; it is about seeking out opportunities to interact with people who have various backgrounds in order to learn new perspectives.
was attributed to: https://www.developgoodhabits.com/core-values/

doing good
type: Class
subclass of: achievement
subclass of: Restriction
  on property: DUL.owlsatisfies
  some values from: Class
    one of: doing good
type: NamedIndividual
type: IndividualValue
subsumed under: achievement
was attributed to: https://examples.yourdictionary.com/examples-of-core-values.html

dominance over people
type: Class
subclass of: power
subclass of: Restriction
  on property: DUL.owlsatisfies
  some values from: Class
    one of: dominance over people
type: NamedIndividual
subsumed under: power
was attributed to: Schwartz92

drive
type: Class
subclass of: ValueSituation
subclass of: Restriction
  on property: DUL.owlsatisfies
  some values from: Class
    one of: drive
type: NamedIndividual
type: IndividualValue
was attributed to: https://georgetownpsychology.com/inner-values/

dutiful
type: Class
subclass of: ValueSituation
subclass of: Restriction
  on property: DUL.owlsatisfies
  some values from: Class
    one of: dutiful
type: NamedIndividual
type: IndividualValue
was attributed to: https://themindfool.com/list-of-core-values-for-a-balanced-life/

earning trust
type: Class
subclass of: self-transcendence
subclass of: Restriction
  on property: DUL.owlsatisfies
  some values from: Class
    one of: earning trust
type: NamedIndividual
type: IndividualValue
subsumed under: self-transcendence
was attributed to: https://examples.yourdictionary.com/examples-of-core-values.html

economy
type: Class
subclass of: order , orderliness
subclass of: Restriction
  on property: DUL.owlsatisfies
  some values from: Class
    one of: economy
type: NamedIndividual
type: IndividualValue
subsumed under: order , orderliness
was attributed to: https://scottjeffrey.com/core-values-list/

education
type: Class
subclass of: ValueSituation
subclass of: Restriction
  on property: DUL.owlsatisfies
  some values from: Class
    one of: education
type: NamedIndividual
type: IndividualValue
comment: Aside from achieving a certification of educational accomplishment, valuing education involves the process of being a lifelong learner and continuing to gain understanding through perceptive insight. Those who value education know that it is never too late to learn–even in a formal learning environment.
was attributed to: https://www.developgoodhabits.com/core-values/ , https://themindfool.com/list-of-core-values-for-a-balanced-life/

effectiveness
type: Class
subclass of: achievement
subclass of: Restriction
  on property: DUL.owlsatisfies
  some values from: Class
    one of: effectiveness
type: NamedIndividual
type: IndividualValue
subsumed under: achievement
was attributed to: https://scottjeffrey.com/core-values-list/

efficiency
type: Class
subclass of: achievement
subclass of: Restriction
  on property: DUL.owlsatisfies
  some values from: Class
    one of: efficiency
type: NamedIndividual
type: IndividualValue
subsumed under: achievement
was attributed to: https://www.developgoodhabits.com/core-values/ , https://scottjeffrey.com/core-values-list/
comment: Valuing efficiency means knowing how to work smarter, not harder. When people are able to work together in balance, work can flow smoothly and things can get done. Valuing this type of operational excellence–whether that is for a group or an individual–means always being prepared for change and improvement in your work.

egalitarianism
type: Class
subclass of: ValueSituation
subclass of: Restriction
  on property: DUL.owlsatisfies
  some values from: Class
    one of: egalitarianism
type: NamedIndividual
type: CulturalValue
was attributed to: Schwartz2006

embeddedness
type: Class
subclass of: ValueSituation
subclass of: Restriction
  on property: DUL.owlsatisfies
  some values from: Class
    one of: embeddedness
type: NamedIndividual
type: CulturalValue
date: 2021-03-05T10:12:25Z
creator: Aldo Gangemi
date: 2021-03-05T10:05:01Z
was attributed to: Schwartz2006

empathy
type: Class
subclass of: feelings
subclass of: Restriction
  on property: DUL.owlsatisfies
  some values from: Class
    one of: empathy
type: NamedIndividual
type: IndividualValue
subsumed under: feelings
was attributed to: https://georgetownpsychology.com/inner-values/

empowerment
type: Class
subclass of: achievement
subclass of: Restriction
  on property: DUL.owlsatisfies
  some values from: Class
    one of: empowerment
type: NamedIndividual
type: IndividualValue
subsumed under: achievement
label: empowerment , empower
was attributed to: https://themindfool.com/list-of-core-values-for-a-balanced-life/ , https://scottjeffrey.com/core-values-list/

endurance
type: Class
subclass of: achievement
subclass of: Restriction
  on property: DUL.owlsatisfies
  some values from: Class
    one of: endurance
type: NamedIndividual
type: IndividualValue
subsumed under: achievement
was attributed to: https://themindfool.com/list-of-core-values-for-a-balanced-life/ , https://scottjeffrey.com/core-values-list/

energy
type: Class
subclass of: health
subclass of: Restriction
  on property: DUL.owlsatisfies
  some values from: Class
    one of: energy
type: NamedIndividual
type: IndividualValue
subsumed under: health
was attributed to: https://georgetownpsychology.com/inner-values/

enjoyment
type: Class
subclass of: feelings
subclass of: Restriction
  on property: DUL.owlsatisfies
  some values from: Class
    one of: enjoyment
type: NamedIndividual
type: IndividualValue
subsumed under: feelings
was attributed to: https://georgetownpsychology.com/inner-values/

enthusiasm
type: Class
subclass of: enjoyment
subclass of: Restriction
  on property: DUL.owlsatisfies
  some values from: Class
    one of: enthusiasm
type: NamedIndividual
type: IndividualValue
subsumed under: enjoyment
was attributed to: https://georgetownpsychology.com/inner-values/

environmental sustainability , environmentalism, protecting the environment, nature (Schwartz)
type: Class
subclass of: universalism
subclass of: Restriction
  on property: DUL.owlsatisfies
  some values from: Class
    one of: environmental sustainability , environmentalism, protecting the environment, nature (Schwartz)
type: NamedIndividual
type: IndividualValue
subsumed under: universalism
comment: Both individuals and companies are becoming increasingly concerned about environmental sustainability to protect the earth for future generations in addition to our own. According to the EPA, air pollution can increase one’s risk of suffering from health issues such as heart attacks, lung disease, and premature mortality. Further, the CDC has reported that the pollution in water can increase one’s risks of developing gastrointestinal illnesses, reproductive issues, and neurological disorders. Considering that the environment can be harming us if it’s not properly cared for has made environmental sustainability a common value among people.
was attributed to: Schwartz92

equality
type: Class
subclass of: spirituality
subclass of: universalism
subclass of: Restriction
  on property: DUL.owlsatisfies
  some values from: Class
    one of: equality
type: NamedIndividual
type: IndividualValue
subsumed under: spirituality
was attributed to: https://georgetownpsychology.com/inner-values/ , Schwartz92

ethics
type: Class
subclass of: spirituality
subclass of: Restriction
  on property: DUL.owlsatisfies
  some values from: Class
    one of: ethics
type: NamedIndividual
type: IndividualValue
subsumed under: spirituality
was attributed to: https://georgetownpsychology.com/inner-values/
label: ethics , ethical

evolution
type: Class
subclass of: ValueSituation
subclass of: Restriction
  on property: DUL.owlsatisfies
  some values from: Class
    one of: evolution
type: NamedIndividual
type: IndividualValue
was attributed to: https://themindfool.com/list-of-core-values-for-a-balanced-life/

excellence
type: Class
subclass of: achievement
subclass of: Restriction
  on property: DUL.owlsatisfies
  some values from: Class
    one of: excellence
type: NamedIndividual
type: IndividualValue
subsumed under: achievement
was attributed to: https://scottjeffrey.com/core-values-list/ , https://benjaminspall.com/core-values/

exciting life
type: Class
subclass of: stimulation
subclass of: Restriction
  on property: DUL.owlsatisfies
  some values from: Class
    one of: exciting life
type: NamedIndividual
type: IndividualValue
subsumed under: stimulation
was attributed to: Schwartz92

experience
type: Class
subclass of: enjoyment
subclass of: Restriction
  on property: DUL.owlsatisfies
  some values from: Class
    one of: experience
type: NamedIndividual
type: IndividualValue
subsumed under: enjoyment
was attributed to: https://scottjeffrey.com/core-values-list/

exploration
type: Class
subclass of: creativity
subclass of: Restriction
  on property: DUL.owlsatisfies
  some values from: Class
    one of: exploration
type: NamedIndividual
type: IndividualValue
subsumed under: creativity
was attributed to: https://georgetownpsychology.com/inner-values/

expressiveness
type: Class
subclass of: creativity
subclass of: Restriction
  on property: DUL.owlsatisfies
  some values from: Class
    one of: expressiveness
type: NamedIndividual
type: IndividualValue
subsumed under: creativity
label: expressiveness , expressive
was attributed to: Haidt, https://georgetownpsychology.com/inner-values/

face
type: Class
subclass of: conservation
subclass of: self-enhancement
subclass of: Restriction
  on property: DUL.owlsatisfies
  some values from: Class
    one of: face
type: NamedIndividual
type: IndividualValue
subsumed under: conservation
subsumed under: self-protection
was attributed to: Schwartz92

fairness , while decision-making
type: Class
subclass of: spirituality
subclass of: Restriction
  on property: DUL.owlsatisfies
  some values from: Class
    one of: fairness , while decision-making
type: NamedIndividual
type: IndividualValue
has negative: cheating
subsumed under: spirituality
comment: While it is true that people say life is not fair, this doesn’t mean that you shouldn’t strive to make it that way. When you value fairness, you can also establish trust and dependability with other people.
label: fairness
was attributed to: https://georgetownpsychology.com/inner-values/

faith
type: Class
subclass of: beliefs
subclass of: Restriction
  on property: DUL.owlsatisfies
  some values from: Class
    one of: faith
type: NamedIndividual
type: IndividualValue
subsumed under: beliefs
was attributed to: https://www.developgoodhabits.com/core-values/ , https://themindfool.com/list-of-core-values-for-a-balanced-life/ , https://benjaminspall.com/core-values/
comment: Valuing faith can look different to everybody, but it often refers to believing that everything will work out the way that it is supposed to. When you value faith, you will allow your beliefs to guide your decisions.

family
type: Class
subclass of: spirituality
subclass of: Restriction
  on property: DUL.owlsatisfies
  some values from: Class
    one of: family
type: NamedIndividual
type: IndividualValue
subsumed under: spirituality
was attributed to: https://www.developgoodhabits.com/core-values/ , https://scottjeffrey.com/core-values-list/ , https://benjaminspall.com/core-values/
comment: Whomever you consider to be your “family” may be a primary value to you because they provide you with support and companionship. Family is often a core value in people’s lives and influences decisions such as where to live and how to celebrate holidays.

family security
type: Class
subclass of: security
subclass of: Restriction
  on property: DUL.owlsatisfies
  some values from: Class
    one of: family security
type: NamedIndividual
type: IndividualValue
subsumed under: security
was attributed to: Schwartz92

famous , fame
type: Class
subclass of: achievement
subclass of: Restriction
  on property: DUL.owlsatisfies
  some values from: Class
    one of: famous , fame
type: NamedIndividual
type: IndividualValue
subsumed under: achievement
label: famous
was attributed to: https://scottjeffrey.com/core-values-list/

fearless , fearlessness
type: Class
subclass of: courage
subclass of: Restriction
  on property: DUL.owlsatisfies
  some values from: Class
    one of: fearless , fearlessness
type: NamedIndividual
type: IndividualValue
subsumed under: courage
label: fearless
was attributed to: https://georgetownpsychology.com/inner-values/

feasibility
type: Class
subclass of: ValueSituation
subclass of: Restriction
  on property: DUL.owlsatisfies
  some values from: Class
    one of: feasibility
type: NamedIndividual
type: IndividualValue
was attributed to: https://themindfool.com/list-of-core-values-for-a-balanced-life/

feelings
type: Class
subclass of: ValueSituation
subclass of: Restriction
  on property: DUL.owlsatisfies
  some values from: Class
    one of: feelings
type: NamedIndividual
type: IndividualValue
was attributed to: https://scottjeffrey.com/core-values-list/

ferocious
type: Class
subclass of: strength
subclass of: Restriction
  on property: DUL.owlsatisfies
  some values from: Class
    one of: ferocious
type: NamedIndividual
type: IndividualValue
subsumed under: strength
was attributed to: https://scottjeffrey.com/core-values-list/

fidelity
type: Class
subclass of: spirituality
subclass of: Restriction
  on property: DUL.owlsatisfies
  some values from: Class
    one of: fidelity
type: NamedIndividual
type: IndividualValue
subsumed under: spirituality
was attributed to: https://georgetownpsychology.com/inner-values/

financial stability
type: Class
subclass of: ValueSituation
subclass of: Restriction
  on property: DUL.owlsatisfies
  some values from: Class
    one of: financial stability
type: NamedIndividual
type: IndividualValue
was attributed to: https://themindfool.com/list-of-core-values-for-a-balanced-life/

fitness
type: Class
subclass of: presence , present
subclass of: Restriction
  on property: DUL.owlsatisfies
  some values from: Class
    one of: fitness
type: NamedIndividual
type: IndividualValue
subsumed under: presence , present
was attributed to: https://www.developgoodhabits.com/core-values/ , https://themindfool.com/list-of-core-values-for-a-balanced-life/
comment: Valuing fitness will help you give energy toward the other values in your life. If your body is healthy, your mind can be healthy as well.

focus , focused
type: Class
subclass of: presence , present
subclass of: Restriction
  on property: DUL.owlsatisfies
  some values from: Class
    one of: focus , focused
type: NamedIndividual
type: IndividualValue
subsumed under: presence , present
label: focus
was attributed to: https://georgetownpsychology.com/inner-values/

foresight
type: Class
subclass of: intelligence
subclass of: Restriction
  on property: DUL.owlsatisfies
  some values from: Class
    one of: foresight
type: NamedIndividual
type: IndividualValue
subsumed under: intelligence
was attributed to: https://georgetownpsychology.com/inner-values/

forgiving
type: Class
subclass of: benevolence
subclass of: Restriction
  on property: DUL.owlsatisfies
  some values from: Class
    one of: forgiving
type: NamedIndividual
type: IndividualValue
subsumed under: benevolence
was attributed to: Schwartz92

fortitude
type: Class
subclass of: strength
subclass of: Restriction
  on property: DUL.owlsatisfies
  some values from: Class
    one of: fortitude
type: NamedIndividual
type: IndividualValue
subsumed under: strength
was attributed to: https://georgetownpsychology.com/inner-values/

freedom
type: Class
subclass of: self-direction
subclass of: Restriction
  on property: DUL.owlsatisfies
  some values from: Class
    one of: freedom
type: NamedIndividual
type: IndividualValue
subsumed under: self-direction
comment: This is a value that most people hold close to their hearts–and it doesn’t only involve valuing your own freedom–it also encompasses advocating from freedom if you ever see an opportunity to do so.
was attributed to: https://georgetownpsychology.com/inner-values/ , Schwartz92

friendship , friendships
type: Class
subclass of: spirituality
subclass of: Restriction
  on property: DUL.owlsatisfies
  some values from: Class
    one of: friendship , friendships
type: NamedIndividual
type: IndividualValue
subsumed under: spirituality
was attributed to: https://themindfool.com/list-of-core-values-for-a-balanced-life/ , https://scottjeffrey.com/core-values-list/ , https://benjaminspall.com/core-values/
label: friendship

frugality
type: Class
subclass of: conservation
subclass of: Restriction
  on property: DUL.owlsatisfies
  some values from: Class
    one of: frugality
type: NamedIndividual
type: IndividualValue
subsumed under: conservation
comment: Having a natural tendency to spend money conservatively suggests that you value frugality. This also means you’re looking toward the future and not focusing on immediate satisfaction.
was attributed to: https://www.developgoodhabits.com/core-values/

fun
type: Class
subclass of: enjoyment
subclass of: Restriction
  on property: DUL.owlsatisfies
  some values from: Class
    one of: fun
type: NamedIndividual
type: IndividualValue
subsumed under: enjoyment
was attributed to: https://scottjeffrey.com/core-values-list/

generosity
type: Class
subclass of: self-transcendence
subclass of: spirituality
subclass of: Restriction
  on property: DUL.owlsatisfies
  some values from: Class
    one of: generosity
type: NamedIndividual
type: IndividualValue
subsumed under: self-transcendence
was attributed to: https://georgetownpsychology.com/inner-values/
comment: If you value generosity, you understand that it doesn’t just involve giving other people money or tangible items. You can also be generous with your time, compassion, and energy.

genius
type: Class
subclass of: intelligence
subclass of: Restriction
  on property: DUL.owlsatisfies
  some values from: Class
    one of: genius
type: NamedIndividual
type: IndividualValue
subsumed under: intelligence
was attributed to: https://scottjeffrey.com/core-values-list/

giving
type: Class
subclass of: spirituality
subclass of: Restriction
  on property: DUL.owlsatisfies
  some values from: Class
    one of: giving
type: NamedIndividual
type: IndividualValue
subsumed under: spirituality
was attributed to: https://scottjeffrey.com/core-values-list/

goodness
type: Class
subclass of: spirituality
subclass of: Restriction
  on property: DUL.owlsatisfies
  some values from: Class
    one of: goodness
type: NamedIndividual
type: IndividualValue
subsumed under: spirituality
was attributed to: https://georgetownpsychology.com/inner-values/

grace
type: Class
subclass of: feelings
subclass of: Restriction
  on property: DUL.owlsatisfies
  some values from: Class
    one of: grace
type: NamedIndividual
type: IndividualValue
subsumed under: feelings
was attributed to: https://www.developgoodhabits.com/core-values/ , https://scottjeffrey.com/core-values-list/
comment: Valuing grace means living a life of unconditional love and gratitude. Having grace is at the core of connecting with other people, as it allows you to understand, empathize, and forgive. Many who value grace find it to offer a sense of healing.

gratitude
type: Class
subclass of: feelings
subclass of: Restriction
  on property: DUL.owlsatisfies
  some values from: Class
    one of: gratitude
type: NamedIndividual
type: IndividualValue
subsumed under: feelings
was attributed to: https://georgetownpsychology.com/inner-values/

greatness
type: Class
subclass of: achievement
subclass of: Restriction
  on property: DUL.owlsatisfies
  some values from: Class
    one of: greatness
type: NamedIndividual
type: IndividualValue
subsumed under: achievement
was attributed to: https://scottjeffrey.com/core-values-list/

growth
type: Class
subclass of: achievement
subclass of: Restriction
  on property: DUL.owlsatisfies
  some values from: Class
    one of: growth
type: NamedIndividual
type: IndividualValue
subsumed under: achievement
comment: People who value growth are never willing to settle and always look for an opportunity to learn in the face of adversity.
was attributed to: https://georgetownpsychology.com/inner-values/

happiness
type: Class
subclass of: feelings
subclass of: Restriction
  on property: DUL.owlsatisfies
  some values from: Class
    one of: happiness
type: NamedIndividual
type: IndividualValue
subsumed under: feelings
comment: While this may seem obvious, many people don’t take the time to truly find what makes them happy to then be able to plan their lives around those things.
was attributed to: https://georgetownpsychology.com/inner-values/

hardworking
type: Class
subclass of: achievement
subclass of: Restriction
  on property: DUL.owlsatisfies
  some values from: Class
    one of: hardworking
type: NamedIndividual
type: IndividualValue
subsumed under: achievement
label: hardworking , hard work , workaholism
was attributed to: https://themindfool.com/list-of-core-values-for-a-balanced-life/ , https://scottjeffrey.com/core-values-list/ , https://benjaminspall.com/core-values/

harmony
type: Class
subclass of: spirituality
subclass of: Restriction
  on property: DUL.owlsatisfies
  some values from: Class
    one of: harmony
type: NamedIndividual
type: CulturalValue
subsumed under: spirituality
was attributed to: https://georgetownpsychology.com/inner-values/ , Schwartz2006

health
type: Class
subclass of: ValueSituation
subclass of: Restriction
  on property: DUL.owlsatisfies
  some values from: Class
    one of: health
type: NamedIndividual
type: IndividualValue
was attributed to: https://themindfool.com/list-of-core-values-for-a-balanced-life/ , https://scottjeffrey.com/core-values-list/ , https://benjaminspall.com/core-values/

healthy competition , fair competition
type: Class
subclass of: fairness , while decision-making
subclass of: Restriction
  on property: DUL.owlsatisfies
  some values from: Class
    one of: healthy competition , fair competition
type: NamedIndividual
type: IndividualValue
subsumed under: fairness , while decision-making
was attributed to: https://themindfool.com/list-of-core-values-for-a-balanced-life/

healthy relationships
type: Class
subclass of: fairness , while decision-making
subclass of: Restriction
  on property: DUL.owlsatisfies
  some values from: Class
    one of: healthy relationships
type: NamedIndividual
type: IndividualValue
subsumed under: fairness , while decision-making
was attributed to: https://themindfool.com/list-of-core-values-for-a-balanced-life/

hedonism
type: Class
subclass of: openness to change
subclass of: self-enhancement
subclass of: Restriction
  on property: DUL.owlsatisfies
  some values from: Class
    one of: hedonism
type: NamedIndividual
type: IndividualValue
subsumed under: openness to change
was attributed to: Schwartz92
comment: Defining goal: pleasure or sensuous gratification for oneself.
comment: “Hedonism shares elements of both openness to change and self-enhancement.”

helpfulness
type: Class
subclass of: benevolence
subclass of: Restriction
  on property: DUL.owlsatisfies
  some values from: Class
    one of: helpfulness
type: NamedIndividual
type: IndividualValue
subsumed under: benevolence
was attributed to: Schwartz92

helping the unfortunate
type: Class
subclass of: helpfulness
subclass of: Restriction
  on property: DUL.owlsatisfies
  some values from: Class
    one of: helping the unfortunate
type: NamedIndividual
type: IndividualValue
subsumed under: helpfulness
was attributed to: https://examples.yourdictionary.com/examples-of-core-values.html

hierarchy
type: Class
subclass of: ValueSituation
subclass of: Restriction
  on property: DUL.owlsatisfies
  some values from: Class
    one of: hierarchy
type: NamedIndividual
type: CulturalValue
contrasts: egalitarianism
was attributed to: Schwartz2006

honesty
type: Class
subclass of: integrity
subclass of: Restriction
  on property: DUL.owlsatisfies
  some values from: Class
    one of: honesty
type: NamedIndividual
type: IndividualValue
subsumed under: integrity
comment: It is very difficult to repair a bad reputation, especially if it is one that suggests you cannot be trusted. Telling the truth and sticking to your word are both critical in the long run, which makes diligently protecting your reputation an important value.
was attributed to: https://georgetownpsychology.com/inner-values/

honor
type: Class
subclass of: integrity
subclass of: Restriction
  on property: DUL.owlsatisfies
  some values from: Class
    one of: honor
type: NamedIndividual
type: IndividualValue
subsumed under: integrity
was attributed to: https://scottjeffrey.com/core-values-list/

hope , hopefulness
type: Class
subclass of: feelings
subclass of: Restriction
  on property: DUL.owlsatisfies
  some values from: Class
    one of: hope , hopefulness
type: NamedIndividual
type: IndividualValue
subsumed under: feelings
was attributed to: https://georgetownpsychology.com/inner-values/
label: hope

humility , humbleness
type: Class
subclass of: conservation
subclass of: self-transcendence
subclass of: spirituality
subclass of: Restriction
  on property: DUL.owlsatisfies
  some values from: Class
    one of: humility , humbleness
type: NamedIndividual
type: IndividualValue
subsumed under: conservation
was attributed to: https://georgetownpsychology.com/inner-values/ , Schwartz92
label: humility

humor
type: Class
subclass of: enjoyment
subclass of: Restriction
  on property: DUL.owlsatisfies
  some values from: Class
    one of: humor
type: NamedIndividual
type: IndividualValue
subsumed under: enjoyment
comment: This should not be overlooked when it comes to values, as humor can make a big difference in lightening the load of a difficult situation. When used appropriately, humor can be an effective tool.
was attributed to: https://www.developgoodhabits.com/core-values/ , https://themindfool.com/list-of-core-values-for-a-balanced-life/ , https://scottjeffrey.com/core-values-list/ , https://benjaminspall.com/core-values/
label: humor , good humor , humorous attitude

imagination , imaginative
type: Class
subclass of: creativity
subclass of: Restriction
  on property: DUL.owlsatisfies
  some values from: Class
    one of: imagination , imaginative
type: NamedIndividual
type: IndividualValue
subsumed under: creativity
was attributed to: https://georgetownpsychology.com/inner-values/
comment: Valuing imagination can be a huge advantage to anyone in our fast-paced society. Being able to come up with an idea that no one else has thought of before can be a huge part of being successful.
label: imagination

impartial
type: Class
subclass of: achievement
subclass of: Restriction
  on property: DUL.owlsatisfies
  some values from: Class
    one of: impartial
type: NamedIndividual
type: IndividualValue
subsumed under: achievement
was attributed to: https://themindfool.com/list-of-core-values-for-a-balanced-life/
label: impartial , impartiality

improvement
type: Class
subclass of: evolution
subclass of: Restriction
  on property: DUL.owlsatisfies
  some values from: Class
    one of: improvement
type: NamedIndividual
type: IndividualValue
subsumed under: evolution
was attributed to: https://scottjeffrey.com/core-values-list/

improvisation
type: Class
subclass of: creativity
subclass of: Restriction
  on property: DUL.owlsatisfies
  some values from: Class
    one of: improvisation
type: NamedIndividual
type: IndividualValue
subsumed under: creativity
was attributed to: https://themindfool.com/list-of-core-values-for-a-balanced-life/

inclusiveness
type: Class
subclass of: diversity
subclass of: Restriction
  on property: DUL.owlsatisfies
  some values from: Class
    one of: inclusiveness
type: NamedIndividual
type: IndividualValue
subsumed under: diversity
was attributed to: https://www.developgoodhabits.com/core-values/
comment: Inclusion is a value that focuses on accepting diversity–it supports real opportunities for all people to form meaningful relationships. Just over the last two decades, people’s rights have evolved through policies and laws that require services to offer accommodations allowing everyone to participate. However, inclusion will never be fully realized until people live in line with these policies. Inclusiveness is about having positive interactions with other people and valuing everyone for who they are. That said, it has to be intrinsically motivated and derive from holding the belief that everyone has value and a right to belong.

independence
type: Class
subclass of: freedom
subclass of: Restriction
  on property: DUL.owlsatisfies
  some values from: Class
    one of: independence
type: NamedIndividual
type: IndividualValue
subsumed under: freedom
was attributed to: https://www.developgoodhabits.com/core-values/ , https://themindfool.com/list-of-core-values-for-a-balanced-life/ , https://scottjeffrey.com/core-values-list/
comment: Valuing your independence doesn’t mean that you never rely on other people for anything. It simply means that you have the ability to give something meaningful back whenever you take from someone else. Independence gives you control over your own life and it makes you a creator rather than a user.

IndividualValue
type: Class
subclass of: Value
comment: Actions pursuing one value “have consequences that conflict with some values but are congruent with others.” This has “practical, psychological, and social consequences.” “Of course, people can and do pursue competing values, but not in a single act. Rather, they do so through different acts, at different times, and in different settings.”
comment: Individual values are responses to three universal requirements: biological needs, agreement on social actions, survival and well-being of groups (Schwartz1992).
comment: Individual values are subjective beliefs of individuals (a) associated with affect, (b) referring to goals that motivate action, (c) transcending specific situations, (d) serving as evaluative standards, (e) ordered according to their relative (our emphasis) importance, and (f) guiding individuals’ action (Schwartz2102).
comment: Schwartz: The relative importance of multiple values guides action. Any attitude or behaviour typically has implications for more than one value. … The tradeoff among relevant, competing values guides attitudes and behaviors… Values influence action when they are relevant in the context (hence likely to be activated) and important to the actor.
comment: Schwartz: Values are beliefs linked inextricably to affect. When values are activated, they become infused with feeling.
comment: Schwartz: Values are ordered by importance relative to one another. People’s values form an ordered system of priorities that characterize them as individuals.
comment: Schwartz: Values refer to desirable goals that motivate action.
comment: Schwartz: Values serve as standards or criteria. Values guide the selection or evaluation of actions, policies, people, and events. People decide what is good or bad, justified or illegitimate, worth doing or avoiding, based on possible consequences for their cherished values. But the impact of values in everyday decisions is rarely conscious. Values enter awareness when the actions or judgments one is considering have conflicting implications for different values one cherishes.
comment: Schwartz: Values transcend specific actions and situations. … This feature distinguishes values from norms and attitudes that usually refer to specific actions, objects, or situations.

individuality
type: Class
subclass of: freedom
subclass of: Restriction
  on property: DUL.owlsatisfies
  some values from: Class
    one of: individuality
type: NamedIndividual
type: IndividualValue
subsumed under: freedom
was attributed to: https://georgetownpsychology.com/inner-values/

influence
type: Class
subclass of: achievement
subclass of: Restriction
  on property: DUL.owlsatisfies
  some values from: Class
    one of: influence
type: NamedIndividual
type: IndividualValue
subsumed under: achievement

inner peace
type: Class
subclass of: feelings
subclass of: Restriction
  on property: DUL.owlsatisfies
  some values from: Class
    one of: inner peace
type: NamedIndividual
type: IndividualValue
subsumed under: feelings
was attributed to: https://www.developgoodhabits.com/core-values/ , https://themindfool.com/list-of-core-values-for-a-balanced-life/
comment: This personal core value refers to the ability to be comfortable with yourself, the people around you, and being accepting of the life you’re living.

innovation , innovativeness
type: Class
subclass of: creativity
subclass of: Restriction
  on property: DUL.owlsatisfies
  some values from: Class
    one of: innovation , innovativeness
type: NamedIndividual
type: IndividualValue
subsumed under: creativity
comment: Innovation is an important value to some because it encompasses forward thinking and the advancement of society by solving collective problems using methods that are both sustainable and efficient, typically with new technology. Whether you’re engaging in incremental innovation by improving something that already exists, or radical innovation by finding an entirely new way of doing something, valuing innovation means never being complacent by accepting the status quo.
was attributed to: https://georgetownpsychology.com/inner-values/
label: innovation

inquisitive
type: Class
subclass of: creativity
subclass of: Restriction
  on property: DUL.owlsatisfies
  some values from: Class
    one of: inquisitive
type: NamedIndividual
type: IndividualValue
subsumed under: creativity
was attributed to: https://georgetownpsychology.com/inner-values/
label: inquisitive , inquisitiveness

insightful
type: Class
subclass of: intelligence
subclass of: Restriction
  on property: DUL.owlsatisfies
  some values from: Class
    one of: insightful
type: NamedIndividual
type: IndividualValue
subsumed under: intelligence
was attributed to: https://georgetownpsychology.com/inner-values/

inspiration
type: Class
subclass of: feelings
subclass of: Restriction
  on property: DUL.owlsatisfies
  some values from: Class
    one of: inspiration
type: NamedIndividual
type: IndividualValue
subsumed under: feelings
was attributed to: https://georgetownpsychology.com/inner-values/
label: inspiration , inspiring

integrity
type: Class
subclass of: ValueSituation
subclass of: Restriction
  on property: DUL.owlsatisfies
  some values from: Class
    one of: integrity
type: NamedIndividual
type: IndividualValue
was attributed to: https://georgetownpsychology.com/inner-values/

intellectual autonomy
type: Class
subclass of: ValueSituation
subclass of: Restriction
  on property: DUL.owlsatisfies
  some values from: Class
    one of: intellectual autonomy
type: NamedIndividual
type: CulturalValue
contrasts: embeddedness
was attributed to: Schwartz2006
date: 2021-03-05T10:12:08Z
creator: Aldo Gangemi

intelligence
type: Class
subclass of: ValueSituation
subclass of: Restriction
  on property: DUL.owlsatisfies
  some values from: Class
    one of: intelligence
type: NamedIndividual
type: IndividualValue
comment: Valuing intelligence isn’t just acknowledging your natural born ability to understand concepts. It involves constantly yearning to learn more.
was attributed to: https://www.developgoodhabits.com/core-values/ , https://scottjeffrey.com/core-values-list/

intensity
type: Class
subclass of: achievement
subclass of: Restriction
  on property: DUL.owlsatisfies
  some values from: Class
    one of: intensity
type: NamedIndividual
type: IndividualValue
subsumed under: achievement
was attributed to: https://scottjeffrey.com/core-values-list/

interpersonal
type: Class
subclass of: conformity
subclass of: Restriction
  on property: DUL.owlsatisfies
  some values from: Class
    one of: interpersonal
type: NamedIndividual
subsumed under: conformity
was attributed to: Schwartz92

intuitiveness
type: Class
subclass of: creativity
subclass of: Restriction
  on property: DUL.owlsatisfies
  some values from: Class
    one of: intuitiveness
type: NamedIndividual
type: IndividualValue
subsumed under: creativity
was attributed to: https://scottjeffrey.com/core-values-list/

irreverent
type: Class
subclass of: feelings
subclass of: Restriction
  on property: DUL.owlsatisfies
  some values from: Class
    one of: irreverent
type: NamedIndividual
type: IndividualValue
subsumed under: feelings
was attributed to: https://scottjeffrey.com/core-values-list/

isolation
type: Class
subclass of: ValueSituation
subclass of: Restriction
  on property: DUL.owlsatisfies
  some values from: Class
    one of: isolation
type: NamedIndividual
type: IndividualValue
was attributed to: https://themindfool.com/list-of-core-values-for-a-balanced-life/

joy , joyfulness
type: Class
subclass of: feelings
subclass of: Restriction
  on property: DUL.owlsatisfies
  some values from: Class
    one of: joy , joyfulness
type: NamedIndividual
type: IndividualValue
subsumed under: feelings
label: joy
was attributed to: https://georgetownpsychology.com/inner-values/

justice
type: Class
subclass of: order , orderliness
subclass of: universalism
subclass of: Restriction
  on property: DUL.owlsatisfies
  some values from: Class
    one of: justice
type: NamedIndividual
type: IndividualValue
subsumed under: order , orderliness
was attributed to: https://georgetownpsychology.com/inner-values/ , Schwartz92
label: justice , social justice
comment: Valuing justice means that you feel a personal sense of responsibility to achieve equality in the world and you feel compassion for those who are not treated fairly. Learning about confirmation bias is a step in the right direction if you want to treat other fairly.

kindness
type: Class
subclass of: feelings
subclass of: Restriction
  on property: DUL.owlsatisfies
  some values from: Class
    one of: kindness
type: NamedIndividual
type: IndividualValue
subsumed under: feelings
was attributed to: https://georgetownpsychology.com/inner-values/

knowledge , knowledgeable
type: Class
subclass of: intelligence
subclass of: Restriction
  on property: DUL.owlsatisfies
  some values from: Class
    one of: knowledge , knowledgeable
type: NamedIndividual
type: IndividualValue
subsumed under: intelligence
was attributed to: https://themindfool.com/list-of-core-values-for-a-balanced-life/ , https://scottjeffrey.com/core-values-list/ , https://benjaminspall.com/core-values/
label: knowledge

lawfulness
type: Class
subclass of: order , orderliness
subclass of: Restriction
  on property: DUL.owlsatisfies
  some values from: Class
    one of: lawfulness
type: NamedIndividual
type: IndividualValue
subsumed under: order , orderliness
was attributed to: https://georgetownpsychology.com/inner-values/

leadership
type: Class
subclass of: achievement
subclass of: Restriction
  on property: DUL.owlsatisfies
  some values from: Class
    one of: leadership
type: NamedIndividual
type: IndividualValue
subsumed under: achievement
was attributed to: https://scottjeffrey.com/core-values-list/

learning
type: Class
subclass of: intelligence
subclass of: Restriction
  on property: DUL.owlsatisfies
  some values from: Class
    one of: learning
type: NamedIndividual
type: IndividualValue
subsumed under: intelligence
was attributed to: https://scottjeffrey.com/core-values-list/

liberty
type: Class
subclass of: freedom
subclass of: Restriction
  on property: DUL.owlsatisfies
  some values from: Class
    one of: liberty
type: NamedIndividual
type: IndividualValue
has negative: oppression
subsumed under: freedom
was attributed to: Haidt

lively
type: Class
subclass of: ValueSituation
subclass of: Restriction
  on property: DUL.owlsatisfies
  some values from: Class
    one of: lively
type: NamedIndividual
type: IndividualValue
was attributed to: https://themindfool.com/list-of-core-values-for-a-balanced-life/

logic , logical thinking
type: Class
subclass of: intelligence
subclass of: Restriction
  on property: DUL.owlsatisfies
  some values from: Class
    one of: logic , logical thinking
type: NamedIndividual
type: IndividualValue
subsumed under: intelligence
label: logic
was attributed to: https://scottjeffrey.com/core-values-list/

longevity
type: Class
subclass of: health
subclass of: Restriction
  on property: DUL.owlsatisfies
  some values from: Class
    one of: longevity
type: NamedIndividual
type: IndividualValue
subsumed under: health
comment: Those who value longevity seek to live in a healthy way in order to spend more time on earth with the ones they love.
was attributed to: https://www.developgoodhabits.com/core-values/

love
type: Class
subclass of: feelings
subclass of: Restriction
  on property: DUL.owlsatisfies
  some values from: Class
    one of: love
type: NamedIndividual
type: IndividualValue
subsumed under: feelings
was attributed to: https://georgetownpsychology.com/inner-values/

loyalty
type: Class
subclass of: benevolence
subclass of: spirituality
subclass of: Restriction
  on property: DUL.owlsatisfies
  some values from: Class
    one of: loyalty
type: NamedIndividual
type: IndividualValue
has negative: betrayal
subsumed under: benevolence
was attributed to: Haidt, https://georgetownpsychology.com/inner-values/ , Schwartz92

management
type: Class
subclass of: order , orderliness
subclass of: Restriction
  on property: DUL.owlsatisfies
  some values from: Class
    one of: management
type: NamedIndividual
type: IndividualValue
subsumed under: order , orderliness
was attributed to: https://themindfool.com/list-of-core-values-for-a-balanced-life/

mastery
type: Class
subclass of: achievement
subclass of: Restriction
  on property: DUL.owlsatisfies
  some values from: Class
    one of: mastery
type: NamedIndividual
type: CulturalValue
subsumed under: achievement
was attributed to: https://georgetownpsychology.com/inner-values/ ; Schwartz2006

maturity
type: Class
subclass of: spirituality
subclass of: Restriction
  on property: DUL.owlsatisfies
  some values from: Class
    one of: maturity
type: NamedIndividual
type: IndividualValue
subsumed under: spirituality
was attributed to: https://themindfool.com/list-of-core-values-for-a-balanced-life/ , https://scottjeffrey.com/core-values-list/

meaning
type: Class
subclass of: achievement
subclass of: spirituality
subclass of: Restriction
  on property: DUL.owlsatisfies
  some values from: Class
    one of: meaning
type: NamedIndividual
type: IndividualValue
subsumed under: achievement
label: meaning , significance
was attributed to: https://scottjeffrey.com/core-values-list/

meaningful work
type: Class
subclass of: ValueSituation
subclass of: Restriction
  on property: DUL.owlsatisfies
  some values from: Class
    one of: meaningful work
type: NamedIndividual
type: IndividualValue
was attributed to: https://themindfool.com/list-of-core-values-for-a-balanced-life/

moderation
type: Class
subclass of: order , orderliness
subclass of: Restriction
  on property: DUL.owlsatisfies
  some values from: Class
    one of: moderation
type: NamedIndividual
type: IndividualValue
subsumed under: order , orderliness
comment: Our brains are quick to become accustomed to any type of stimulation. In fact, our bodies are too. This is why doing the exact same workout every day wouldn’t continue to produce results six months after starting the routine. This is also why people go through that honeymoon phase when they meet a new partner. Your brain always wants more. However, this often leads to things that are unhealthy–more junk food, more alcohol, more Netflix. However, if you value moderation, you will find that you’re able to experience more fulfillment and gratification from everyday things. You won’t need to be searching for extremes to find some type of brain rush.
was attributed to: https://georgetownpsychology.com/inner-values/

modesty
type: Class
subclass of: tradition , traditional, eespect for tradition
subclass of: Restriction
  on property: DUL.owlsatisfies
  some values from: Class
    one of: modesty
type: NamedIndividual
type: IndividualValue
subsumed under: tradition , traditional, eespect for tradition
comment: If you value modesty, you let your actions speak for themselves and avoid boasting about your abilities.
label: modesty , modest
was attributed to: Schwartz92

morality
type: Class
subclass of: ValueSituation
subclass of: Restriction
  on property: DUL.owlsatisfies
  some values from: Class
    one of: morality
type: NamedIndividual
type: IndividualValue
was attributed to: https://benjaminspall.com/core-values/

motivation
type: Class
subclass of: achievement
subclass of: Restriction
  on property: DUL.owlsatisfies
  some values from: Class
    one of: motivation
type: NamedIndividual
type: IndividualValue
subsumed under: achievement
was attributed to: https://georgetownpsychology.com/inner-values/

novelty
type: Class
subclass of: openness to change
subclass of: Restriction
  on property: DUL.owlsatisfies
  some values from: Class
    one of: novelty
type: NamedIndividual
type: IndividualValue
subsumed under: openness to change
comment: Some value the pursuit of new challenges, circumstances, and experiences in life. If you live in the same town where you were born and tend to stick to a routine, novelty is likely not one of your personal core values.
was attributed to: https://www.developgoodhabits.com/core-values/

objectivity
type: Class
subclass of: ValueSituation
subclass of: Restriction
  on property: DUL.owlsatisfies
  some values from: Class
    one of: objectivity
type: NamedIndividual
type: IndividualValue
comment: It is helpful to value objectivity in the workplace because it means you’re willing to look at the facts when you’re confronted with a conflict. You’re able to put your emotions and personal involvement aside.
was attributed to: https://www.developgoodhabits.com/core-values/

open-mindedness , openness
type: Class
subclass of: creativity
subclass of: intelligence
subclass of: Restriction
  on property: DUL.owlsatisfies
  some values from: Class
    one of: open-mindedness , openness
type: NamedIndividual
type: IndividualValue
subsumed under: creativity
comment: Even if you don’t think you will agree with an idea or concept, being able to consider it and be willing to entertain a variety of ideas is a good value to have.
was attributed to: https://georgetownpsychology.com/inner-values/
label: open-mindedness

openness to change
type: Class
subclass of: anxiety-free
subclass of: growth
subclass of: open-mindedness , openness
subclass of: personal focus
subclass of: Restriction
  on property: DUL.owlsatisfies
  some values from: Class
    one of: openness to change
type: NamedIndividual
type: IndividualValue
contrasts: conservation
subsumed under: anxiety-free
subsumed under: personal focus
was attributed to: Schwartz92
comment: This dimension captures the conflict between values that emphasize independence of thought, action, and feelings and readiness for change (self-direction, stimulation) and values that emphasize order, self-restriction, preservation of the past, and resistance to change (security, conformity, tradition).”

optimism
type: Class
subclass of: feelings
subclass of: Restriction
  on property: DUL.owlsatisfies
  some values from: Class
    one of: optimism
type: NamedIndividual
type: IndividualValue
subsumed under: feelings
was attributed to: https://themindfool.com/list-of-core-values-for-a-balanced-life/ , https://scottjeffrey.com/core-values-list/ , https://benjaminspall.com/core-values/

order , orderliness
type: Class
subclass of: ValueSituation
subclass of: Restriction
  on property: DUL.owlsatisfies
  some values from: Class
    one of: order , orderliness
type: NamedIndividual
type: IndividualValue
was attributed to: https://georgetownpsychology.com/inner-values/
comment: Many people have a hard time making any personal progress if they’re living in a chaotic environment. Cleanliness and orderliness are often values people hold to maintain a calm state of mind.
label: order

organization
type: Class
subclass of: order , orderliness
subclass of: Restriction
  on property: DUL.owlsatisfies
  some values from: Class
    one of: organization
type: NamedIndividual
type: IndividualValue
subsumed under: order , orderliness
was attributed to: https://georgetownpsychology.com/inner-values/

originality
type: Class
subclass of: creativity
subclass of: Restriction
  on property: DUL.owlsatisfies
  some values from: Class
    one of: originality
type: NamedIndividual
type: IndividualValue
subsumed under: creativity
was attributed to: https://georgetownpsychology.com/inner-values/
comment: Valuing originality means that you walk your own path and stray away from what everyone else seems to be doing. This value comes naturally and can usually be seen through art or creativity.

partnership
type: Class
subclass of: community
subclass of: Restriction
  on property: DUL.owlsatisfies
  some values from: Class
    one of: partnership
type: NamedIndividual
type: IndividualValue
subsumed under: community
comment: When you value partnership, you also value collaboration, respect, teamwork, and loyalty. Whether it’s in a business or a personal setting, valuing partnership sets the stage for various ideas and opinions to come together to create something better than the sum of its parts.
was attributed to: https://www.developgoodhabits.com/core-values/

passion
type: Class
subclass of: feelings
subclass of: Restriction
  on property: DUL.owlsatisfies
  some values from: Class
    one of: passion
type: NamedIndividual
type: IndividualValue
subsumed under: feelings
comment: Having enthusiasm for living your life on your own terms will ensure that you also have the determination that is needed to succeed.
was attributed to: https://georgetownpsychology.com/inner-values/

patience
type: Class
subclass of: ValueSituation
subclass of: Restriction
  on property: DUL.owlsatisfies
  some values from: Class
    one of: patience
type: NamedIndividual
type: IndividualValue
comment: Valuing patience means recognizing the fact that sometimes the only thing that can make something work out in your favor is time.
was attributed to: https://georgetownpsychology.com/inner-values/

patriotism
type: Class
subclass of: conservation
subclass of: Restriction
  on property: DUL.owlsatisfies
  some values from: Class
    one of: patriotism
type: NamedIndividual
type: IndividualValue
subsumed under: conservation
was attributed to: https://www.developgoodhabits.com/core-values/ , https://themindfool.com/list-of-core-values-for-a-balanced-life/
comment: It’s about learning from our past mistakes and being vigilant about considering if the country is headed in the right direction. Patriotism is a spirit of camaraderie for others who live in this country, regardless of their background. Valuing patriotism is about knowing when the country is fumbling, and doing your part to make it a better place.

peace , peaceful
type: Class
subclass of: feelings
subclass of: Restriction
  on property: DUL.owlsatisfies
  some values from: Class
    one of: peace , peaceful
type: NamedIndividual
type: IndividualValue
subsumed under: feelings
was attributed to: https://georgetownpsychology.com/inner-values/
label: peace

performance
type: Class
subclass of: achievement
subclass of: Restriction
  on property: DUL.owlsatisfies
  some values from: Class
    one of: performance
type: NamedIndividual
type: IndividualValue
subsumed under: achievement
was attributed to: https://scottjeffrey.com/core-values-list/

perseverance
type: Class
subclass of: achievement
subclass of: Restriction
  on property: DUL.owlsatisfies
  some values from: Class
    one of: perseverance
type: NamedIndividual
type: IndividualValue
subsumed under: achievement
was attributed to: https://www.developgoodhabits.com/core-values/ , https://benjaminspall.com/core-values/
comment: People who become very successful have undoubtedly failed more often throughout their lives than many others have even tried. It is easy to quit, but perseverance pays off.

persistence
type: Class
subclass of: achievement
subclass of: strength
subclass of: Restriction
  on property: DUL.owlsatisfies
  some values from: Class
    one of: persistence
type: NamedIndividual
type: IndividualValue
subsumed under: achievement
was attributed to: https://georgetownpsychology.com/inner-values/
comment: Persistence is the determination to keep going, regardless of how you feel. Even if you feel like quitting, you keep working because you know success doesn’t come without a cost. Valuing persistence is a motivating factor in continuing to take action on the days that you want to quit, which allows you to keep accumulating results. With persistence, you press on until you achieve whatever goal you’re working toward.

personal focus
type: Class
subclass of: ValueSituation
subclass of: Restriction
  on property: DUL.owlsatisfies
  some values from: Class
    one of: personal focus
type: NamedIndividual
type: IndividualValue
comment: Individual values are subjective beliefs of individuals (a) associated with affect, (b) referring to goals that motivate action, (c) transcending specific situations, (d) serving as evaluative standards, (e) ordered according to their relative (our emphasis) importance, and (f) guiding individuals’ action (Schwartz2102).
comment: Individual values are responses to three universal requirements: biological needs, agreement on social actions, survival and well-being of groups (Schwartz1992).

personal security
type: Class
subclass of: personal focus
subclass of: security
subclass of: Restriction
  on property: DUL.owlsatisfies
  some values from: Class
    one of: personal security
type: NamedIndividual
subsumed under: personal focus
subsumed under: security
was attributed to: Schwartz92

philanthropy
type: Class
subclass of: universalism
subclass of: Restriction
  on property: DUL.owlsatisfies
  some values from: Class
    one of: philanthropy
type: NamedIndividual
type: IndividualValue
subsumed under: universalism
was attributed to: https://themindfool.com/list-of-core-values-for-a-balanced-life/

playfulness
type: Class
subclass of: enjoyment
subclass of: Restriction
  on property: DUL.owlsatisfies
  some values from: Class
    one of: playfulness
type: NamedIndividual
type: IndividualValue
subsumed under: enjoyment
was attributed to: https://georgetownpsychology.com/inner-values/
comment: If you can really appreciate a good break from hard work to have a laugh, you probably value playfulness. Letting your mind relax is healthy in order to be really effective once you get back to work.

pleasure
type: Class
subclass of: hedonism
subclass of: Restriction
  on property: DUL.owlsatisfies
  some values from: Class
    one of: pleasure
type: NamedIndividual
type: IndividualValue
subsumed under: hedonism
was attributed to: Schwartz92

poise
type: Class
subclass of: feelings
subclass of: Restriction
  on property: DUL.owlsatisfies
  some values from: Class
    one of: poise
type: NamedIndividual
type: IndividualValue
subsumed under: feelings
was attributed to: https://georgetownpsychology.com/inner-values/

politeness
type: Class
subclass of: conformity
subclass of: Restriction
  on property: DUL.owlsatisfies
  some values from: Class
    one of: politeness
type: NamedIndividual
type: IndividualValue
subsumed under: conformity
was attributed to: Schwartz92

positivity , positive Mindset
type: Class
subclass of: ValueSituation
subclass of: Restriction
  on property: DUL.owlsatisfies
  some values from: Class
    one of: positivity , positive Mindset
type: NamedIndividual
type: IndividualValue
label: positivity
was attributed to: https://themindfool.com/list-of-core-values-for-a-balanced-life/ , https://benjaminspall.com/core-values/

potential
type: Class
subclass of: achievement
subclass of: Restriction
  on property: DUL.owlsatisfies
  some values from: Class
    one of: potential
type: NamedIndividual
type: IndividualValue
subsumed under: achievement
was attributed to: https://scottjeffrey.com/core-values-list/

power
type: Class
subclass of: anxiety avoidance
subclass of: self-enhancement
subclass of: self-protection
subclass of: strength
subclass of: Restriction
  on property: DUL.owlsatisfies
  some values from: Class
    one of: power
type: NamedIndividual
type: IndividualValue
subsumed under: anxiety avoidance
subsumed under: self-protection
comment: Defining goal: social status and prestige, control or dominance over people and resources.
was attributed to: Schwartz92

preparedness
type: Class
subclass of: anticipation
subclass of: Restriction
  on property: DUL.owlsatisfies
  some values from: Class
    one of: preparedness
type: NamedIndividual
type: IndividualValue
subsumed under: anticipation
comment: There are certainly some things in life that you can never prepare for, but by valuing this quality, people are able to either avoid or mitigate unwelcomed circumstances. Identifying risks in any area of your life and coming up with potential plans for action is rarely something that is regretted.
was attributed to: https://www.developgoodhabits.com/core-values/

presence , present
type: Class
subclass of: ValueSituation
subclass of: Restriction
  on property: DUL.owlsatisfies
  some values from: Class
    one of: presence , present
type: NamedIndividual
type: IndividualValue
was attributed to: https://themindfool.com/list-of-core-values-for-a-balanced-life/ , https://scottjeffrey.com/core-values-list/

productivity , productiveness
type: Class
subclass of: achievement
subclass of: Restriction
  on property: DUL.owlsatisfies
  some values from: Class
    one of: productivity , productiveness
type: NamedIndividual
type: IndividualValue
subsumed under: achievement
was attributed to: https://georgetownpsychology.com/inner-values/
label: productivity

professionalism
type: Class
subclass of: achievement
subclass of: Restriction
  on property: DUL.owlsatisfies
  some values from: Class
    one of: professionalism
type: NamedIndividual
type: IndividualValue
subsumed under: achievement
comment: This isn’t just about knowing how to act professionally in the workplace. It is also about knowing how to be polite, use good manners, and be dependable in your everyday life.
was attributed to: https://georgetownpsychology.com/inner-values/

prosperity
type: Class
subclass of: achievement
subclass of: Restriction
  on property: DUL.owlsatisfies
  some values from: Class
    one of: prosperity
type: NamedIndividual
type: IndividualValue
subsumed under: achievement
was attributed to: https://themindfool.com/list-of-core-values-for-a-balanced-life/ , https://scottjeffrey.com/core-values-list/

punctuality
type: Class
subclass of: order , orderliness
subclass of: Restriction
  on property: DUL.owlsatisfies
  some values from: Class
    one of: punctuality
type: NamedIndividual
type: IndividualValue
subsumed under: order , orderliness
comment: The thing about valuing punctuality is that it shows a great respect for other people’s time as well. This allows people to depend on you and hopefully have a mutual respect for your time as well.
was attributed to: https://www.developgoodhabits.com/core-values/

purpose
type: Class
subclass of: ValueSituation
subclass of: Restriction
  on property: DUL.owlsatisfies
  some values from: Class
    one of: purpose
type: NamedIndividual
type: IndividualValue
was attributed to: https://scottjeffrey.com/core-values-list/

quality
type: Class
subclass of: ValueSituation
subclass of: Restriction
  on property: DUL.owlsatisfies
  some values from: Class
    one of: quality
type: NamedIndividual
type: IndividualValue
was attributed to: https://themindfool.com/list-of-core-values-for-a-balanced-life/ , https://scottjeffrey.com/core-values-list/

racing towards goals until achieved
type: Class
subclass of: achievement
subclass of: Restriction
  on property: DUL.owlsatisfies
  some values from: Class
    one of: racing towards goals until achieved
type: NamedIndividual
type: IndividualValue
subsumed under: achievement
was attributed to: https://themindfool.com/list-of-core-values-for-a-balanced-life/

realism
type: Class
subclass of: intelligence
subclass of: Restriction
  on property: DUL.owlsatisfies
  some values from: Class
    one of: realism
type: NamedIndividual
type: IndividualValue
subsumed under: intelligence
was attributed to: https://georgetownpsychology.com/inner-values/
label: realism , realistic

reason , reasonability, Reasonable
type: Class
subclass of: intelligence
subclass of: Restriction
  on property: DUL.owlsatisfies
  some values from: Class
    one of: reason , reasonability, Reasonable
type: NamedIndividual
type: IndividualValue
subsumed under: intelligence
label: reason
was attributed to: https://georgetownpsychology.com/inner-values/

receptiveness
type: Class
subclass of: ValueSituation
subclass of: Restriction
  on property: DUL.owlsatisfies
  some values from: Class
    one of: receptiveness
type: NamedIndividual
type: IndividualValue
was attributed to: https://themindfool.com/list-of-core-values-for-a-balanced-life/

recognition
type: Class
subclass of: achievement
subclass of: Restriction
  on property: DUL.owlsatisfies
  some values from: Class
    one of: recognition
type: NamedIndividual
type: IndividualValue
subsumed under: achievement
was attributed to: https://www.developgoodhabits.com/core-values/ , https://scottjeffrey.com/core-values-list/
comment: Valuing recognition of your work means that you know its importance and you want other people to see that as well. You want confirmation of its importance to the world. This doesn’t mean that you always feel like you need to be praised, it’s simply a value that means you feel a sense of satisfaction when you’re reassured that you’re adding value to some sort of domain. Being recognized for your work helps you stay motivated to maintain–or even improve–your performance.

recreation
type: Class
subclass of: enjoyment
subclass of: Restriction
  on property: DUL.owlsatisfies
  some values from: Class
    one of: recreation
type: NamedIndividual
type: IndividualValue
subsumed under: enjoyment
was attributed to: https://scottjeffrey.com/core-values-list/

reflection , reflective, Reflectiveness
type: Class
subclass of: intelligence
subclass of: Restriction
  on property: DUL.owlsatisfies
  some values from: Class
    one of: reflection , reflective, Reflectiveness
type: NamedIndividual
type: IndividualValue
subsumed under: intelligence
label: reflection
was attributed to: https://georgetownpsychology.com/inner-values/

relaxation
type: Class
subclass of: ValueSituation
subclass of: Restriction
  on property: DUL.owlsatisfies
  some values from: Class
    one of: relaxation
type: NamedIndividual
type: IndividualValue
was attributed to: https://themindfool.com/list-of-core-values-for-a-balanced-life/

reliability
type: Class
subclass of: trust
subclass of: Restriction
  on property: DUL.owlsatisfies
  some values from: Class
    one of: reliability
type: NamedIndividual
type: IndividualValue
subsumed under: trust

resilience
type: Class
subclass of: ValueSituation
subclass of: Restriction
  on property: DUL.owlsatisfies
  some values from: Class
    one of: resilience
type: NamedIndividual
type: IndividualValue
comment: How easy is it for you to cope with adversity? If you value resilience, you strive to be flexible, go with the flow, and bounce back after things don’t go your way.
was attributed to: https://www.developgoodhabits.com/core-values/ , https://themindfool.com/list-of-core-values-for-a-balanced-life/

respect , respectfulness , respect for others
type: Class
subclass of: conformity
subclass of: feelings
subclass of: Restriction
  on property: DUL.owlsatisfies
  some values from: Class
    one of: respect , respectfulness , respect for others
type: NamedIndividual
type: IndividualValue
subsumed under: conformity
was attributed to: https://georgetownpsychology.com/inner-values/ , Schwartz92
label: respect
comment: Giving and receiving respect is important because it fosters a sense of connection between people and it makes us feel comfortable expressing ourselves to others. Valuing respect means you’re able to accept other people, despite their difference in background or beliefs from your own. Having respect helps build feelings of trust, security, and safety.

respect for self
type: Class
subclass of: ValueSituation
subclass of: Restriction
  on property: DUL.owlsatisfies
  some values from: Class
    one of: respect for self
type: NamedIndividual
type: IndividualValue
was attributed to: https://benjaminspall.com/core-values/

responsibility
type: Class
subclass of: benevolence
subclass of: integrity
subclass of: Restriction
  on property: DUL.owlsatisfies
  some values from: Class
    one of: responsibility
type: NamedIndividual
type: IndividualValue
subsumed under: benevolence
comment: Some people strongly value having a sense of sole personal accountability for the success of a specific area of their community or group. This often promotes self-confidence and can lead to a deep sense of accomplishment.
was attributed to: https://georgetownpsychology.com/inner-values/ , Schwartz92

responsiveness
type: Class
subclass of: ValueSituation
subclass of: Restriction
  on property: DUL.owlsatisfies
  some values from: Class
    one of: responsiveness
type: NamedIndividual
type: IndividualValue
comment: Responsiveness is an important value that seems to have gone missing from many people, both personally and professionally. And, with the endless ways to get in touch these days, it’s surprising that some people simply fail to do so. Those who value responsiveness make it a point to answer others’ inquiries in a timely manner because that is how they prefer people to respond to them. Valuing responsiveness is also about valuing respect for other people and their time.
was attributed to: https://www.developgoodhabits.com/core-values/

rest
type: Class
subclass of: health
subclass of: Restriction
  on property: DUL.owlsatisfies
  some values from: Class
    one of: rest
type: NamedIndividual
type: IndividualValue
subsumed under: health
was attributed to: https://www.developgoodhabits.com/core-values/
comment: Knowing when to stop is a huge factor in success. You need to rest your body and your mind to be on top of your game when it really counts.

restraint
type: Class
subclass of: strength
subclass of: Restriction
  on property: DUL.owlsatisfies
  some values from: Class
    one of: restraint
type: NamedIndividual
type: IndividualValue
subsumed under: strength
comment: Restraint naturally emerges in the short pause your body takes after breathing in and before breathing out. Your mind and body both know how to pause before taking action, allowing you the time to generate awareness and consider the results of your next move before choosing to take it. Valuing this ability to pause helps you make decisions in a deeper state of awareness to determine the best course of action.
was attributed to: https://georgetownpsychology.com/inner-values/

results-oriented
type: Class
subclass of: achievement
subclass of: Restriction
  on property: DUL.owlsatisfies
  some values from: Class
    one of: results-oriented
type: NamedIndividual
type: IndividualValue
subsumed under: achievement
was attributed to: https://scottjeffrey.com/core-values-list/

reverence
type: Class
subclass of: feelings
subclass of: Restriction
  on property: DUL.owlsatisfies
  some values from: Class
    one of: reverence
type: NamedIndividual
type: IndividualValue
subsumed under: feelings
was attributed to: https://georgetownpsychology.com/inner-values/

rigor
type: Class
subclass of: strength
subclass of: Restriction
  on property: DUL.owlsatisfies
  some values from: Class
    one of: rigor
type: NamedIndividual
type: IndividualValue
subsumed under: strength
was attributed to: https://scottjeffrey.com/core-values-list/

risk , risk-Taking
type: Class
subclass of: achievement
subclass of: Restriction
  on property: DUL.owlsatisfies
  some values from: Class
    one of: risk , risk-Taking
type: NamedIndividual
type: IndividualValue
subsumed under: achievement
comment: If you value taking risks, you know that if you follow your gut, there is a chance that it will lead to a huge payoff. You’re not afraid to face the option of failing if there is also an option for success.
label: risk
was attributed to: https://www.developgoodhabits.com/core-values/ , https://scottjeffrey.com/core-values-list/

risk-management
type: Class
subclass of: management
subclass of: Restriction
  on property: DUL.owlsatisfies
  some values from: Class
    one of: risk-management
type: NamedIndividual
type: IndividualValue
subsumed under: management
was attributed to: https://themindfool.com/list-of-core-values-for-a-balanced-life/

rules
type: Class
subclass of: conformity
subclass of: Restriction
  on property: DUL.owlsatisfies
  some values from: Class
    one of: rules
type: NamedIndividual
type: IndividualValue
subsumed under: conformity
was attributed to: Schwartz92

sanctity
type: Class
subclass of: ValueSituation
subclass of: Restriction
  on property: DUL.owlsatisfies
  some values from: Class
    one of: sanctity
type: NamedIndividual
type: IndividualValue
has negative: degradation
was attributed to: Haidt

satisfaction
type: Class
subclass of: feelings
subclass of: Restriction
  on property: DUL.owlsatisfies
  some values from: Class
    one of: satisfaction
type: NamedIndividual
type: IndividualValue
subsumed under: feelings
was attributed to: https://scottjeffrey.com/core-values-list/

security
type: Class
subclass of: conservation
subclass of: order , orderliness
subclass of: Restriction
  on property: DUL.owlsatisfies
  some values from: Class
    one of: security
type: NamedIndividual
type: IndividualValue
subsumed under: conservation
comment: Defining goal: safety, harmony, and stability of society, of relationships, and of self.
comment: People want to minimize their risk of being a victim of any type of security threat, which makes this a common value.
was attributed to: Schwartz92

self-awareness
type: Class
subclass of: ValueSituation
subclass of: Restriction
  on property: DUL.owlsatisfies
  some values from: Class
    one of: self-awareness
type: NamedIndividual
type: IndividualValue
comment: This is a very important core value to have, as it lets you realize when you’ve messed up and pinpoint how you can fix your mistakes in the future. Having self-awareness also means you know why you react to certain situations in the way that you do and recognize triggers that may lead to certain emotions.
was attributed to: https://www.developgoodhabits.com/core-values/ , https://themindfool.com/list-of-core-values-for-a-balanced-life/

self-confidence
type: Class
subclass of: strength
subclass of: Restriction
  on property: DUL.owlsatisfies
  some values from: Class
    one of: self-confidence
type: NamedIndividual
type: IndividualValue
subsumed under: strength
label: self-confidence , self-reliance
comment: Having this value involves being successful in such a way that you recognize your skills are making a positive contribution to your community or those around you.
was attributed to: https://georgetownpsychology.com/inner-values/

self-control
type: Class
subclass of: ValueSituation
subclass of: Restriction
  on property: DUL.owlsatisfies
  some values from: Class
    one of: self-control
type: NamedIndividual
type: IndividualValue
was attributed to: https://themindfool.com/list-of-core-values-for-a-balanced-life/

self-direction
type: Class
subclass of: openness to change
subclass of: ValueSituation
subclass of: Restriction
  on property: DUL.owlsatisfies
  some values from: Class
    one of: self-direction
type: NamedIndividual
type: IndividualValue
subsumed under: openness to change
comment: Defining goal: independent thought and action–choosing, creating, exploring.
was attributed to: Schwartz92

self-discipline
type: Class
subclass of: conformity
subclass of: Restriction
  on property: DUL.owlsatisfies
  some values from: Class
    one of: self-discipline
type: NamedIndividual
type: IndividualValue
subsumed under: conformity
was attributed to: Schwartz92

self-enhancement
type: Class
subclass of: evolution
subclass of: personal focus
subclass of: Restriction
  on property: DUL.owlsatisfies
  some values from: Class
    one of: self-enhancement
type: NamedIndividual
type: IndividualValue
contrasts: self-transcendence
subsumed under: evolution
subsumed under: personal focus
was attributed to: Schwartz92
comment: “The second dimension contrasts ‘self-enhancement’ and ‘self-transcendence’ values. This dimension captures the conflict between values that emphasize concern for the welfare and interests of others (universalism, benevolence) and values that emphasize pursuit of one’s own interests and relative success and dominance over others (power, achievement).”

self-indulgence
type: Class
subclass of: hedonism
subclass of: Restriction
  on property: DUL.owlsatisfies
  some values from: Class
    one of: self-indulgence
type: NamedIndividual
type: IndividualValue
subsumed under: hedonism
was attributed to: Schwartz92

self-love
type: Class
subclass of: ValueSituation
subclass of: Restriction
  on property: DUL.owlsatisfies
  some values from: Class
    one of: self-love
type: NamedIndividual
type: IndividualValue
was attributed to: https://themindfool.com/list-of-core-values-for-a-balanced-life/

self-protection
type: Class
subclass of: ValueSituation
subclass of: Restriction
  on property: DUL.owlsatisfies
  some values from: Class
    one of: self-protection
type: NamedIndividual
type: IndividualValue
was attributed to: Schwartz92

self-respect
type: Class
subclass of: ValueSituation
subclass of: Restriction
  on property: DUL.owlsatisfies
  some values from: Class
    one of: self-respect
type: NamedIndividual
type: IndividualValue
was attributed to: https://www.developgoodhabits.com/core-values/ , https://themindfool.com/list-of-core-values-for-a-balanced-life/
comment: Those who value self-respect know when to say “no” to anything in their lives that is emotionally, mentally, or financially unhealthy. Valuing self-respect means knowing your worth, your value, and being willing to advocate for yourself whenever necessary. Given these beliefs, you’re able to set boundaries with other people and draw a firm line in regard to how you will and won’t be treated.

self-transcendence
type: Class
subclass of: anxiety-free
subclass of: growth
subclass of: social focus
subclass of: Restriction
  on property: DUL.owlsatisfies
  some values from: Class
    one of: self-transcendence
type: NamedIndividual
type: IndividualValue
subsumed under: anxiety-free
subsumed under: social focus
comment: “The second dimension contrasts ‘self-enhancement’ and ‘self-transcendence’ values. This dimension captures the conflict between values that emphasize concern for the welfare and interests of others (universalism, benevolence) and values that emphasize pursuit of one’s own interests and relative success and dominance over others (power, achievement).”
was attributed to: Schwartz92

selflessness
type: Class
subclass of: spirituality
subclass of: Restriction
  on property: DUL.owlsatisfies
  some values from: Class
    one of: selflessness
type: NamedIndividual
type: IndividualValue
subsumed under: spirituality
was attributed to: https://georgetownpsychology.com/inner-values/
label: selflessness , selfless

sensitivity
type: Class
subclass of: spirituality
subclass of: Restriction
  on property: DUL.owlsatisfies
  some values from: Class
    one of: sensitivity
type: NamedIndividual
type: IndividualValue
subsumed under: spirituality
was attributed to: https://georgetownpsychology.com/inner-values/

serenity
type: Class
subclass of: feelings
subclass of: Restriction
  on property: DUL.owlsatisfies
  some values from: Class
    one of: serenity
type: NamedIndividual
type: IndividualValue
subsumed under: feelings
was attributed to: https://georgetownpsychology.com/inner-values/

service
type: Class
subclass of: spirituality
subclass of: Restriction
  on property: DUL.owlsatisfies
  some values from: Class
    one of: service
type: NamedIndividual
type: IndividualValue
subsumed under: spirituality
was attributed to: https://georgetownpsychology.com/inner-values/
comment: When one of your personal core values is service, you find a sense of fulfillment in sharing your talents or abilities with others in a way that is beneficial to their lives, and you’re willing to contribute to your society without expecting anything in return.
label: service , service to others

sharing
type: Class
subclass of: spirituality
subclass of: Restriction
  on property: DUL.owlsatisfies
  some values from: Class
    one of: sharing
type: NamedIndividual
type: IndividualValue
subsumed under: spirituality
was attributed to: https://georgetownpsychology.com/inner-values/

silence
type: Class
subclass of: presence , present
subclass of: Restriction
  on property: DUL.owlsatisfies
  some values from: Class
    one of: silence
type: NamedIndividual
type: IndividualValue
subsumed under: presence , present
was attributed to: https://scottjeffrey.com/core-values-list/

simplicity
type: Class
subclass of: presence , present
subclass of: Restriction
  on property: DUL.owlsatisfies
  some values from: Class
    one of: simplicity
type: NamedIndividual
type: IndividualValue
subsumed under: presence , present
comment: People tend to make things more complicated than they need to be. Those who prefer to keep things straightforward are those who value simplicity.
was attributed to: https://georgetownpsychology.com/inner-values/

sincerity
type: Class
subclass of: integrity
subclass of: Restriction
  on property: DUL.owlsatisfies
  some values from: Class
    one of: sincerity
type: NamedIndividual
type: IndividualValue
subsumed under: integrity
was attributed to: https://georgetownpsychology.com/inner-values/
comment: This can go hand-in-hand with honesty, but it also involves being authentic in everything you say and avoiding putting on any type of front to impress other people.

skill
type: Class
subclass of: achievement
subclass of: Restriction
  on property: DUL.owlsatisfies
  some values from: Class
    one of: skill
type: NamedIndividual
type: IndividualValue
subsumed under: achievement
was attributed to: https://scottjeffrey.com/core-values-list/

skillfulness
type: Class
subclass of: achievement
subclass of: Restriction
  on property: DUL.owlsatisfies
  some values from: Class
    one of: skillfulness
type: NamedIndividual
type: IndividualValue
subsumed under: achievement
was attributed to: https://georgetownpsychology.com/inner-values/

smart
type: Class
subclass of: intelligence
subclass of: Restriction
  on property: DUL.owlsatisfies
  some values from: Class
    one of: smart
type: NamedIndividual
type: IndividualValue
subsumed under: intelligence
was attributed to: https://scottjeffrey.com/core-values-list/

social focus
type: Class
subclass of: ValueSituation
subclass of: Restriction
  on property: DUL.owlsatisfies
  some values from: Class
    one of: social focus
type: NamedIndividual
contrasts: personal focus
date: 2021-03-04T10:30:13Z

social order
type: Class
subclass of: security
subclass of: Restriction
  on property: DUL.owlsatisfies
  some values from: Class
    one of: social order
type: NamedIndividual
type: IndividualValue
subsumed under: security
was attributed to: Schwartz92

societal security
type: Class
subclass of: conservation
subclass of: security
subclass of: social focus
subclass of: Restriction
  on property: DUL.owlsatisfies
  some values from: Class
    one of: societal security
type: NamedIndividual
subsumed under: conservation
subsumed under: social focus
was attributed to: Schwartz92

solitude
type: Class
subclass of: presence , present
subclass of: Restriction
  on property: DUL.owlsatisfies
  some values from: Class
    one of: solitude
type: NamedIndividual
type: IndividualValue
subsumed under: presence , present
was attributed to: https://scottjeffrey.com/core-values-list/

spirit
type: Class
subclass of: spirituality
subclass of: Restriction
  on property: DUL.owlsatisfies
  some values from: Class
    one of: spirit
type: NamedIndividual
type: IndividualValue
subsumed under: spirituality
was attributed to: https://scottjeffrey.com/core-values-list/

spirituality
type: Class
subclass of: ValueSituation
subclass of: Restriction
  on property: DUL.owlsatisfies
  some values from: Class
    one of: spirituality
type: NamedIndividual
type: IndividualValue
was attributed to: https://georgetownpsychology.com/inner-values/

spontaneity , spontaneous
type: Class
subclass of: enjoyment
subclass of: Restriction
  on property: DUL.owlsatisfies
  some values from: Class
    one of: spontaneity , spontaneous
type: NamedIndividual
type: IndividualValue
subsumed under: enjoyment
was attributed to: https://georgetownpsychology.com/inner-values/
label: spontaneity

stability
type: Class
subclass of: order , orderliness
subclass of: Restriction
  on property: DUL.owlsatisfies
  some values from: Class
    one of: stability
type: NamedIndividual
type: IndividualValue
subsumed under: order , orderliness
was attributed to: https://georgetownpsychology.com/inner-values/

status , social status , prestige
type: Class
subclass of: achievement
subclass of: power
subclass of: Restriction
  on property: DUL.owlsatisfies
  some values from: Class
    one of: status , social status , prestige
type: NamedIndividual
type: IndividualValue
subsumed under: achievement
was attributed to: Schwartz92

stewardship
type: Class
subclass of: spirituality
subclass of: Restriction
  on property: DUL.owlsatisfies
  some values from: Class
    one of: stewardship
type: NamedIndividual
type: IndividualValue
subsumed under: spirituality
was attributed to: https://georgetownpsychology.com/inner-values/

stillness
type: Class
subclass of: presence , present
subclass of: Restriction
  on property: DUL.owlsatisfies
  some values from: Class
    one of: stillness
type: NamedIndividual
type: IndividualValue
subsumed under: presence , present
comment: Embracing silence or calmness can not only be a great value to have, but also a great skill. Those who know when to speak and when to listen are often highly respected.
was attributed to: https://www.developgoodhabits.com/core-values/

stimulation
type: Class
subclass of: openness to change
subclass of: Restriction
  on property: DUL.owlsatisfies
  some values from: Class
    one of: stimulation
type: NamedIndividual
type: IndividualValue
subsumed under: openness to change
comment: Defining goal: excitement, novelty, and challenge in life.
was attributed to: Schwartz92

strength
type: Class
subclass of: ValueSituation
subclass of: Restriction
  on property: DUL.owlsatisfies
  some values from: Class
    one of: strength
type: NamedIndividual
type: IndividualValue
was attributed to: https://scottjeffrey.com/core-values-list/

structure
type: Class
subclass of: order , orderliness
subclass of: Restriction
  on property: DUL.owlsatisfies
  some values from: Class
    one of: structure
type: NamedIndividual
type: IndividualValue
subsumed under: order , orderliness
comment: Valuing structure involves having a sense of control over your surroundings and exercising discipline to maintain an acceptable level of restriction.
was attributed to: https://www.developgoodhabits.com/core-values/ , https://scottjeffrey.com/core-values-list/

success , successful
type: Class
subclass of: achievement
subclass of: Restriction
  on property: DUL.owlsatisfies
  some values from: Class
    one of: success , successful
type: NamedIndividual
type: IndividualValue
subsumed under: achievement
was attributed to: Schwartz92
label: success

support , supportiveness
type: Class
subclass of: spirituality
subclass of: Restriction
  on property: DUL.owlsatisfies
  some values from: Class
    one of: support , supportiveness
type: NamedIndividual
type: IndividualValue
subsumed under: spirituality
was attributed to: https://georgetownpsychology.com/inner-values/
label: support

surprise
type: Class
subclass of: enjoyment
subclass of: Restriction
  on property: DUL.owlsatisfies
  some values from: Class
    one of: surprise
type: NamedIndividual
type: IndividualValue
subsumed under: enjoyment
was attributed to: https://scottjeffrey.com/core-values-list/

sustainability
type: Class
subclass of: spirituality
subclass of: Restriction
  on property: DUL.owlsatisfies
  some values from: Class
    one of: sustainability
type: NamedIndividual
type: IndividualValue
subsumed under: spirituality
was attributed to: https://scottjeffrey.com/core-values-list/

talent
type: Class
subclass of: achievement
subclass of: Restriction
  on property: DUL.owlsatisfies
  some values from: Class
    one of: talent
type: NamedIndividual
type: IndividualValue
subsumed under: achievement
was attributed to: https://www.developgoodhabits.com/core-values/ , https://scottjeffrey.com/core-values-list/
comment: Your talents are your abilities, skills, and competencies that govern what you can do. With a growth mindset, you work on developing your talents over time because you know that you can. When you value talent in yourself and in others, you can optimize your time by working in line with your realized value. If you happen to have true talent in a specific area–either personally or professionally–you also possess a great amount of intrinsic value that can have a strong positive impact on your life.

teamwork
type: Class
subclass of: spirituality
subclass of: Restriction
  on property: DUL.owlsatisfies
  some values from: Class
    one of: teamwork
type: NamedIndividual
type: IndividualValue
subsumed under: spirituality
was attributed to: https://georgetownpsychology.com/inner-values/

temperament
type: Class
subclass of: ValueSituation
subclass of: Restriction
  on property: DUL.owlsatisfies
  some values from: Class
    one of: temperament
type: NamedIndividual
type: IndividualValue
was attributed to: https://themindfool.com/list-of-core-values-for-a-balanced-life/

temperance
type: Class
subclass of: strength
subclass of: Restriction
  on property: DUL.owlsatisfies
  some values from: Class
    one of: temperance
type: NamedIndividual
type: IndividualValue
subsumed under: strength
was attributed to: https://scottjeffrey.com/core-values-list/

thankfulness
type: Class
subclass of: feelings
subclass of: Restriction
  on property: DUL.owlsatisfies
  some values from: Class
    one of: thankfulness
type: NamedIndividual
type: IndividualValue
subsumed under: feelings
was attributed to: https://georgetownpsychology.com/inner-values/

thoroughfulness
type: Class
subclass of: order , orderliness
subclass of: Restriction
  on property: DUL.owlsatisfies
  some values from: Class
    one of: thoroughfulness
type: NamedIndividual
type: IndividualValue
subsumed under: order , orderliness
was attributed to: https://scottjeffrey.com/core-values-list/

thoughtfulness , thought (Schwartz)
type: Class
subclass of: intelligence
subclass of: self-direction
subclass of: Restriction
  on property: DUL.owlsatisfies
  some values from: Class
    one of: thoughtfulness , thought (Schwartz)
type: NamedIndividual
type: IndividualValue
subsumed under: intelligence
was attributed to: https://georgetownpsychology.com/inner-values/ , Schwartz92

timeliness
type: Class
subclass of: order , orderliness
subclass of: Restriction
  on property: DUL.owlsatisfies
  some values from: Class
    one of: timeliness
type: NamedIndividual
type: IndividualValue
subsumed under: order , orderliness
was attributed to: https://georgetownpsychology.com/inner-values/

tolerance
type: Class
subclass of: spirituality
subclass of: universalism
subclass of: Restriction
  on property: DUL.owlsatisfies
  some values from: Class
    one of: tolerance
type: NamedIndividual
type: IndividualValue
subsumed under: spirituality
was attributed to: https://georgetownpsychology.com/inner-values/ , Schwartz92
comment: Valuing tolerance goes beyond having an ability to “put up” with something. When you value tolerance, it means you have a positive view toward relationships among people who differ from each other. Tolerance can be linked to respect, equality, and independence. Valuing tolerance makes it possible for conflicting beliefs and ideas to coexist, as long as they lie within common moral values. Tolerance is a critical component in social unity and can be a remedy to prejudice.

toughness
type: Class
subclass of: strength
subclass of: Restriction
  on property: DUL.owlsatisfies
  some values from: Class
    one of: toughness
type: NamedIndividual
type: IndividualValue
subsumed under: strength
was attributed to: https://georgetownpsychology.com/inner-values/

tradition , traditional, eespect for tradition
type: Class
subclass of: conservation
subclass of: social focus
subclass of: Restriction
  on property: DUL.owlsatisfies
  some values from: Class
    one of: tradition , traditional, eespect for tradition
type: NamedIndividual
type: IndividualValue
subsumed under: conservation
subsumed under: personal focus
was attributed to: https://georgetownpsychology.com/inner-values/ , Schwartz92
comment: Defining goal: respect, commitment, and acceptance of the customs and ideas that one’s culture or religion provides.
comment: Valuing tradition would involve ritualizing some sort of history in your life to add a sense of enrichment, and passing that on to subsequent generations. Think of your family traditions for holidays, birthdays, or even just summer nights. If you value tradition, you’re likely to teach these things to future generations of your family to keep the traditions going. Many people value tradition because it helps define the uniqueness of a family or any type of tight-knit community.
label: tradition

tranquility
type: Class
subclass of: feelings
subclass of: Restriction
  on property: DUL.owlsatisfies
  some values from: Class
    one of: tranquility
type: NamedIndividual
type: IndividualValue
subsumed under: feelings
was attributed to: https://georgetownpsychology.com/inner-values/

transparency
type: Class
subclass of: integrity
subclass of: Restriction
  on property: DUL.owlsatisfies
  some values from: Class
    one of: transparency
type: NamedIndividual
type: IndividualValue
subsumed under: integrity
was attributed to: https://georgetownpsychology.com/inner-values/

trust
type: Class
subclass of: integrity
subclass of: Restriction
  on property: DUL.owlsatisfies
  some values from: Class
    one of: trust
type: NamedIndividual
type: IndividualValue
subsumed under: integrity
was attributed to: https://georgetownpsychology.com/inner-values/
label: trust , trustworthiness, Trustworthy

trusting relationships
type: Class
subclass of: community
subclass of: trust
subclass of: Restriction
  on property: DUL.owlsatisfies
  some values from: Class
    one of: trusting relationships
type: NamedIndividual
type: IndividualValue
subsumed under: community
comment: Valuing trusting relationships means that one of your top priorities is to be able to express your thoughts and feelings in a mutually trusting environment where you and the other person have confidence in the integrity of one another.
was attributed to: https://www.developgoodhabits.com/core-values/

truth , truthfulness
type: Class
subclass of: integrity
subclass of: Restriction
  on property: DUL.owlsatisfies
  some values from: Class
    one of: truth , truthfulness
type: NamedIndividual
type: IndividualValue
subsumed under: integrity
label: truth
was attributed to: https://georgetownpsychology.com/inner-values/

understanding
type: Class
subclass of: intelligence
subclass of: Restriction
  on property: DUL.owlsatisfies
  some values from: Class
    one of: understanding
type: NamedIndividual
type: IndividualValue
subsumed under: intelligence
was attributed to: https://scottjeffrey.com/core-values-list/

uniqueness
type: Class
subclass of: creativity
subclass of: Restriction
  on property: DUL.owlsatisfies
  some values from: Class
    one of: uniqueness
type: NamedIndividual
type: IndividualValue
subsumed under: creativity
was attributed to: https://georgetownpsychology.com/inner-values/

unity
type: Class
subclass of: spirituality
subclass of: Restriction
  on property: DUL.owlsatisfies
  some values from: Class
    one of: unity
type: NamedIndividual
type: IndividualValue
subsumed under: spirituality
comment: The value of unity is that everyone on a team or in a group setting is respected. Unity breeds cooperation, increases people’s enthusiasm, and furnishes an empowering atmosphere. When you value unity, you believe in fostering a sense of belonging and improving everyone’s wellbeing.
was attributed to: https://georgetownpsychology.com/inner-values/

universalism
type: Class
subclass of: self-transcendence
subclass of: Restriction
  on property: DUL.owlsatisfies
  some values from: Class
    one of: universalism
type: NamedIndividual
type: IndividualValue
subsumed under: self-transcendence
comment: Defining goal: understanding, appreciation, tolerance, and protection for the welfare of all people and for nature.
was attributed to: Schwartz92

valor
type: Class
subclass of: courage
subclass of: Restriction
  on property: DUL.owlsatisfies
  some values from: Class
    one of: valor
type: NamedIndividual
type: IndividualValue
subsumed under: courage
was attributed to: https://georgetownpsychology.com/inner-values/

versatility
type: Class
subclass of: ValueSituation
subclass of: Restriction
  on property: DUL.owlsatisfies
  some values from: Class
    one of: versatility
type: NamedIndividual
type: IndividualValue
was attributed to: https://www.developgoodhabits.com/core-values/
comment: Our society loves “things”. We love extra features, “all-in-one” products, and things of the sort–and we also love saving money. Putting those two things together undoubtedly makes versatility a common value among people. Recycling and repurposing are popular ways in which people act on their value of versatility, as reusing older products to make something “new” or completely starting from scratch with used materials are both environmentally sustainable practices, which are also valued among people.

vibrant
type: Class
subclass of: presence , present
subclass of: Restriction
  on property: DUL.owlsatisfies
  some values from: Class
    one of: vibrant
type: NamedIndividual
type: IndividualValue
subsumed under: presence , present
was attributed to: https://themindfool.com/list-of-core-values-for-a-balanced-life/

victory
type: Class
subclass of: achievement
subclass of: Restriction
  on property: DUL.owlsatisfies
  some values from: Class
    one of: victory
type: NamedIndividual
type: IndividualValue
subsumed under: achievement
was attributed to: https://scottjeffrey.com/core-values-list/

vigor
type: Class
subclass of: strength
subclass of: Restriction
  on property: DUL.owlsatisfies
  some values from: Class
    one of: vigor
type: NamedIndividual
type: IndividualValue
subsumed under: strength
was attributed to: https://scottjeffrey.com/core-values-list/

vision
type: Class
subclass of: intelligence
subclass of: Restriction
  on property: DUL.owlsatisfies
  some values from: Class
    one of: vision
type: NamedIndividual
type: IndividualValue
subsumed under: intelligence
was attributed to: https://themindfool.com/list-of-core-values-for-a-balanced-life/ , https://scottjeffrey.com/core-values-list/

vitality
type: Class
subclass of: health
subclass of: Restriction
  on property: DUL.owlsatisfies
  some values from: Class
    one of: vitality
type: NamedIndividual
type: IndividualValue
subsumed under: health
was attributed to: https://georgetownpsychology.com/inner-values/

wealth
type: Class
subclass of: achievement
subclass of: power
subclass of: Restriction
  on property: DUL.owlsatisfies
  some values from: Class
    one of: wealth
type: NamedIndividual
type: IndividualValue
subsumed under: achievement
was attributed to: Schwartz92
comment: Whether you value wealth to be able to provide for your family or to be able to live a peaceful life, this is a personal core value that isn’t as selfish as it may sound.

welcoming
type: Class
subclass of: feelings
subclass of: Restriction
  on property: DUL.owlsatisfies
  some values from: Class
    one of: welcoming
type: NamedIndividual
type: IndividualValue
subsumed under: feelings
was attributed to: https://scottjeffrey.com/core-values-list/

will
type: Class
subclass of: strength
subclass of: Restriction
  on property: DUL.owlsatisfies
  some values from: Class
    one of: will
type: NamedIndividual
type: IndividualValue
subsumed under: strength
was attributed to: https://scottjeffrey.com/core-values-list/

winning
type: Class
subclass of: achievement
subclass of: Restriction
  on property: DUL.owlsatisfies
  some values from: Class
    one of: winning
type: NamedIndividual
type: IndividualValue
subsumed under: achievement
was attributed to: https://scottjeffrey.com/core-values-list/

wisdom
type: Class
subclass of: intelligence
subclass of: universalism
subclass of: Restriction
  on property: DUL.owlsatisfies
  some values from: Class
    one of: wisdom
type: NamedIndividual
type: IndividualValue
subsumed under: intelligence
was attributed to: https://georgetownpsychology.com/inner-values/ , Schwartz92
comment: Valuing wisdom isn’t just about putting an emphasis on knowledge. It is also about having your knowledge stand the test of time and being able to reflect on your experiences to exact your knowledge.

wonder
type: Class
subclass of: open-mindedness , openness
subclass of: Restriction
  on property: DUL.owlsatisfies
  some values from: Class
    one of: wonder
type: NamedIndividual
type: IndividualValue
subsumed under: open-mindedness , openness
was attributed to: https://georgetownpsychology.com/inner-values/

work-Life_Balance
type: Class
subclass of: management
subclass of: Restriction
  on property: DUL.owlsatisfies
  some values from: Class
    one of: work-Life_Balance
type: NamedIndividual
type: IndividualValue
subsumed under: management
was attributed to: https://themindfool.com/list-of-core-values-for-a-balanced-life/

workmanship
type: Class
subclass of: achievement
subclass of: Restriction
  on property: DUL.owlsatisfies
  some values from: Class
    one of: workmanship
type: NamedIndividual
type: IndividualValue
subsumed under: achievement
was attributed to: https://themindfool.com/list-of-core-values-for-a-balanced-life/

world_of_Peace
type: Class
subclass of: universalism
subclass of: Restriction
  on property: DUL.owlsatisfies
  some values from: Class
    one of: world_of_Peace
type: NamedIndividual
type: IndividualValue
subsumed under: universalism
was attributed to: Schwartz92

zeal
type: Class
subclass of: achievement
subclass of: Restriction
  on property: DUL.owlsatisfies
  some values from: Class
    one of: zeal
type: NamedIndividual
type: IndividualValue
subsumed under: achievement
was attributed to: https://themindfool.com/list-of-core-values-for-a-balanced-life/

synset-value-noun-6
type: Class
subclass of: FrameOccurrence
subclass of: Class
  union of: Awareness
  union of: Judgment
  union of: Regard
type: NamedIndividual
type: SynsetFrame
subsumed under: Awareness
subsumed under: Judgment
subsumed under: Regard
comment: an ideal accepted by some individual or group; "he has old-fashioned values"

betrayal
type: NamedIndividual
was attributed to: Haidt

cheating
type: NamedIndividual
was attributed to: Haidt

degradation
type: NamedIndividual
was attributed to: Haidt

harm
type: NamedIndividual
was attributed to: Haidt

life is meaningless
type: NamedIndividual
type: NegativeValue
comment: The negative value, according to which 'life is meaningless'.
was attributed to: https://examples.yourdictionary.com/examples-of-core-values.html

oppression
type: NamedIndividual
was attributed to: Haidt

Other people are fundamentally untrustworthy and unloving
type: NamedIndividual
type: NegativeValue
date: 2021-03-05T00:59:05Z
comment: The negative value, according to which other people are fundamentally untrustworthy and unloving.
was attributed to: https://examples.yourdictionary.com/examples-of-core-values.html

People are powerless to change their fates or personal situations
type: NamedIndividual
type: NegativeValue
date: 2021-03-05T00:57:07Z
comment: The negative value, according to which people are powerless to change their fates or personal situations.
was attributed to: https://examples.yourdictionary.com/examples-of-core-values.html

Self doesn’t deserve good things or relationships in life
type: NamedIndividual
type: NegativeValue
date: 2021-03-05T00:58:08Z
comment: The negative value, according to which self doesn’t deserve good things or relationships in life.
was attributed to: https://examples.yourdictionary.com/examples-of-core-values.html

World is a fundamentally brutal place and only the strong survive
type: NamedIndividual
type: NegativeValue
date: 2021-03-05T00:55:42Z
comment: The negative value, according to which world is a fundamentally brutal place and only the strong survive.
was attributed to: https://examples.yourdictionary.com/examples-of-core-values.html

subversion
type: NamedIndividual
was attributed to: Haidt

synset-prize-verb-1
type: NamedIndividual
type: SynsetFrame
subsumed under: Judgment
comment: hold dear; "I prize these old photographs"

synset-respect-verb-1
type: NamedIndividual
type: SynsetFrame
subsumed under: Judgment
comment: regard highly; think much of; "I respect his judgement"; "We prize his creativity"

synset-value-noun-1
type: NamedIndividual
type: SynsetFrame
subsumed under: Usefulness
comment: a numerical quantity measured or assigned or computed; "the value assigned was 16 milliseconds"

synset-value-noun-2
type: NamedIndividual
type: SynsetFrame
subsumed under: Differentiation
comment: the quality (positive or negative) that renders something desirable or valuable; "the Shakespearean Shylock is of dubious value in the modern world"

synset-value-verb-1
type: NamedIndividual
type: SynsetFrame
subsumed under: Expertise
subsumed under: Quantity
comment: fix or determine the value of; assign a value to; "value the jewelry and art work in the estate"